BDBM50438218 CHEMBL2407767
SMILES: CC(=O)N1CCC(CC1)n1cc(cn1)-c1cnc(N)c2oc(cc12)-c1cccc(c1)C#N
InChI Key: InChIKey=QMKZTPJYKZRXJU-UHFFFAOYSA-N
Data: 2 IC50
Activity Spreadsheet -- Enzyme Inhibition Constant Data from BindingDB
Found 2 hits for monomerid = 50438218
Trg + Lig
Ki
nM
ΔG°
kcal/mole
IC50
nM
Kd
nM
EC50/IC50
nM
koff
s-1
kon
M-1s-1
pHTemp
°C
Mitogen-activated protein kinase kinase kinase 7 interacting protein 1
(Homo sapiens (Human))
BDBM50438218
(CHEMBL2407767)
Show SMILES CC(=O)N1CCC(CC1)n1cc(cn1)-c1cnc(N)c2oc(cc12)-c1cccc(c1)C#N
Show InChI InChI=1S/C24H22N6O2/c1-15(31)29-7-5-19(6-8-29)30-14-18(12-28-30)21-13-27-24(26)23-20(21)10-22(32-23)17-4-2-3-16(9-17)11-25/h2-4,9-10,12-14,19H,5-8H2,1H3,(H2,26,27)
n/an/a 250n/an/an/an/an/an/a
OSI Pharmaceuticals LLC
Curated by ChEMBL
Assay Description
Inhibition of truncated TAK1-TAB1(unknown origin) using MKK7 as substrate by ALPHAScreen assay in presence of ATP
Bioorg Med Chem Lett 23: 4517-22 (2013)
Article DOI: 10.1016/j.bmcl.2013.06.053
BindingDB Entry DOI: 10.7270/Q2ZK5J2K
Mitogen-activated protein kinase kinase kinase 7
(Homo sapiens (Human))
BDBM50438218
(CHEMBL2407767)
Show SMILES CC(=O)N1CCC(CC1)n1cc(cn1)-c1cnc(N)c2oc(cc12)-c1cccc(c1)C#N
Show InChI InChI=1S/C24H22N6O2/c1-15(31)29-7-5-19(6-8-29)30-14-18(12-28-30)21-13-27-24(26)23-20(21)10-22(32-23)17-4-2-3-16(9-17)11-25/h2-4,9-10,12-14,19H,5-8H2,1H3,(H2,26,27)
Reactome pathway
n/an/a 370n/an/an/an/an/an/a
OSI Pharmaceuticals LLC
Curated by ChEMBL
Assay Description
Inhibition of TAK1 in human HCT116 cells assessed as inhibition of TNF-alpha-stimulated JNK phosphorylation
Bioorg Med Chem Lett 23: 4517-22 (2013)
Article DOI: 10.1016/j.bmcl.2013.06.053
BindingDB Entry DOI: 10.7270/Q2ZK5J2K