BDBM50438331 CHEMBL2408615
SMILES: Nc1ncc(-c2cnn(c2)[C@H]2CC[C@H](O)CC2)c2c(CF)c(oc12)-c1cccc2nnsc12
InChI Key: InChIKey=VLSKNLVBBCEHSR-HDJSIYSDSA-N
Data: 3 IC50
Activity Spreadsheet -- Enzyme Inhibition Constant Data from BindingDB
Found 3 hits for monomerid = 50438331
Trg + Lig
Ki
nM
ΔG°
kcal/mole
IC50
nM
Kd
nM
EC50/IC50
nM
koff
s-1
kon
M-1s-1
pHTemp
°C
Aurora kinase B
(Homo sapiens (Human))
BDBM50438331
(CHEMBL2408615)
Show SMILES Nc1ncc(-c2cnn(c2)[C@H]2CC[C@H](O)CC2)c2c(CF)c(oc12)-c1cccc2nnsc12 |r,wU:13.14,wD:10.10,(28.58,-24.18,;30.05,-23.7,;31.18,-24.73,;32.65,-24.26,;32.97,-22.76,;34.43,-22.29,;34.91,-20.82,;36.45,-20.82,;36.92,-22.28,;35.68,-23.19,;38.39,-22.76,;38.7,-24.28,;40.16,-24.75,;41.31,-23.73,;42.77,-24.21,;40.99,-22.22,;39.52,-21.74,;31.83,-21.74,;31.83,-20.2,;33.08,-19.29,;32.91,-17.76,;30.37,-19.72,;29.46,-20.97,;30.37,-22.21,;29.9,-18.26,;30.94,-17.12,;30.47,-15.65,;28.96,-15.32,;27.93,-16.47,;26.39,-16.47,;25.91,-17.93,;27.15,-18.84,;28.4,-17.93,)|
Show InChI InChI=1S/C23H21FN6O2S/c24-8-16-19-17(12-9-27-30(11-12)13-4-6-14(31)7-5-13)10-26-23(25)21(19)32-20(16)15-2-1-3-18-22(15)33-29-28-18/h1-3,9-11,13-14,31H,4-8H2,(H2,25,26)/t13-,14-
Reactome pathway
n/an/a 1.50E+3n/an/an/an/an/an/a
OSI Pharmaceuticals LLC
Curated by ChEMBL
Assay Description
Inhibition of aurora B kinase in human HT-29 cells assessed as inhibition of histone H3 S10 phosphorylation
Bioorg Med Chem Lett 23: 4511-6 (2013)
Article DOI: 10.1016/j.bmcl.2013.06.054
BindingDB Entry DOI: 10.7270/Q2FN17MJ
Mitogen-activated protein kinase kinase kinase 7 interacting protein 1
(Homo sapiens (Human))
BDBM50438331
(CHEMBL2408615)
Show SMILES Nc1ncc(-c2cnn(c2)[C@H]2CC[C@H](O)CC2)c2c(CF)c(oc12)-c1cccc2nnsc12 |r,wU:13.14,wD:10.10,(28.58,-24.18,;30.05,-23.7,;31.18,-24.73,;32.65,-24.26,;32.97,-22.76,;34.43,-22.29,;34.91,-20.82,;36.45,-20.82,;36.92,-22.28,;35.68,-23.19,;38.39,-22.76,;38.7,-24.28,;40.16,-24.75,;41.31,-23.73,;42.77,-24.21,;40.99,-22.22,;39.52,-21.74,;31.83,-21.74,;31.83,-20.2,;33.08,-19.29,;32.91,-17.76,;30.37,-19.72,;29.46,-20.97,;30.37,-22.21,;29.9,-18.26,;30.94,-17.12,;30.47,-15.65,;28.96,-15.32,;27.93,-16.47,;26.39,-16.47,;25.91,-17.93,;27.15,-18.84,;28.4,-17.93,)|
Show InChI InChI=1S/C23H21FN6O2S/c24-8-16-19-17(12-9-27-30(11-12)13-4-6-14(31)7-5-13)10-26-23(25)21(19)32-20(16)15-2-1-3-18-22(15)33-29-28-18/h1-3,9-11,13-14,31H,4-8H2,(H2,25,26)/t13-,14-
n/an/a 17n/an/an/an/an/an/a
OSI Pharmaceuticals LLC
Curated by ChEMBL
Assay Description
Inhibition of TAK1-TAB1 (unknown origin) by alphascreen assay in presence of ATP
Bioorg Med Chem Lett 23: 4511-6 (2013)
Article DOI: 10.1016/j.bmcl.2013.06.054
BindingDB Entry DOI: 10.7270/Q2FN17MJ
Mitogen-activated protein kinase kinase kinase 7
(Homo sapiens (Human))
BDBM50438331
(CHEMBL2408615)
Show SMILES Nc1ncc(-c2cnn(c2)[C@H]2CC[C@H](O)CC2)c2c(CF)c(oc12)-c1cccc2nnsc12 |r,wU:13.14,wD:10.10,(28.58,-24.18,;30.05,-23.7,;31.18,-24.73,;32.65,-24.26,;32.97,-22.76,;34.43,-22.29,;34.91,-20.82,;36.45,-20.82,;36.92,-22.28,;35.68,-23.19,;38.39,-22.76,;38.7,-24.28,;40.16,-24.75,;41.31,-23.73,;42.77,-24.21,;40.99,-22.22,;39.52,-21.74,;31.83,-21.74,;31.83,-20.2,;33.08,-19.29,;32.91,-17.76,;30.37,-19.72,;29.46,-20.97,;30.37,-22.21,;29.9,-18.26,;30.94,-17.12,;30.47,-15.65,;28.96,-15.32,;27.93,-16.47,;26.39,-16.47,;25.91,-17.93,;27.15,-18.84,;28.4,-17.93,)|
Show InChI InChI=1S/C23H21FN6O2S/c24-8-16-19-17(12-9-27-30(11-12)13-4-6-14(31)7-5-13)10-26-23(25)21(19)32-20(16)15-2-1-3-18-22(15)33-29-28-18/h1-3,9-11,13-14,31H,4-8H2,(H2,25,26)/t13-,14-
Reactome pathway
n/an/a 45n/an/an/an/an/an/a
OSI Pharmaceuticals LLC
Curated by ChEMBL
Assay Description
Inhibition of TAK1 in human HCT116 cells assessed as inhibition of TNF-alpha-stimulated JNK phosphorylation
Bioorg Med Chem Lett 23: 4511-6 (2013)
Article DOI: 10.1016/j.bmcl.2013.06.054
BindingDB Entry DOI: 10.7270/Q2FN17MJ