BDBM50438558 CHEMBL2413139
SMILES: CN(C)CCN(Cc1ccc(Cl)c(Cl)c1)C(=O)c1c(C)c2ccccc2n1-c1ccc(F)cc1
InChI Key: InChIKey=NMJHGHRZJKQANU-UHFFFAOYSA-N
Data: 1 IC50
Activity Spreadsheet -- Enzyme Inhibition Constant Data from BindingDB
Found 1 hit for monomerid = 50438558
Trg + Lig
Ki
nM
ΔG°
kcal/mole
IC50
nM
Kd
nM
EC50/IC50
nM
koff
s-1
kon
M-1s-1
pHTemp
°C
Centromere-associated protein E
(Homo sapiens (Human))
BDBM50438558
(CHEMBL2413139)
Show SMILES CN(C)CCN(Cc1ccc(Cl)c(Cl)c1)C(=O)c1c(C)c2ccccc2n1-c1ccc(F)cc1
Show InChI InChI=1S/C27H26Cl2FN3O/c1-18-22-6-4-5-7-25(22)33(21-11-9-20(30)10-12-21)26(18)27(34)32(15-14-31(2)3)17-19-8-13-23(28)24(29)16-19/h4-13,16H,14-15,17H2,1-3H3
NCI pathway
Reactome pathway
n/an/a 2.10E+3n/an/an/an/an/an/a
Takeda Pharmaceutical Company Limited
Curated by ChEMBL
Assay Description
Inhibition of human ATPase activity of CENP-E motor domain assessed as ADP production after 60 mins by ADP-Glo luminescence assay
Bioorg Med Chem 21: 5488-502 (2013)
Article DOI: 10.1016/j.bmc.2013.05.067
BindingDB Entry DOI: 10.7270/Q20G3MKN