BDBM50438561 CHEMBL2413136
SMILES: CN(C)CCCn1c(C(=O)N(C)Cc2ccc(Cl)c(Cl)c2)c(-c2ccc(F)cc2)c2cscc2c1=O
InChI Key: InChIKey=AAZICRXDUWYMRN-UHFFFAOYSA-N
Data: 1 IC50
Activity Spreadsheet -- Enzyme Inhibition Constant Data from BindingDB
Found 1 hit for monomerid = 50438561
Trg + Lig
Ki
nM
ΔG°
kcal/mole
IC50
nM
Kd
nM
EC50/IC50
nM
koff
s-1
kon
M-1s-1
pHTemp
°C
Centromere-associated protein E
(Homo sapiens (Human))
BDBM50438561
(CHEMBL2413136)
Show SMILES CN(C)CCCn1c(C(=O)N(C)Cc2ccc(Cl)c(Cl)c2)c(-c2ccc(F)cc2)c2cscc2c1=O
Show InChI InChI=1S/C27H26Cl2FN3O2S/c1-31(2)11-4-12-33-25(27(35)32(3)14-17-5-10-22(28)23(29)13-17)24(18-6-8-19(30)9-7-18)20-15-36-16-21(20)26(33)34/h5-10,13,15-16H,4,11-12,14H2,1-3H3
NCI pathway
Reactome pathway
n/an/a 300n/an/an/an/an/an/a
Takeda Pharmaceutical Company Limited
Curated by ChEMBL
Assay Description
Inhibition of human ATPase activity of CENP-E motor domain assessed as ADP production after 60 mins by ADP-Glo luminescence assay
Bioorg Med Chem 21: 5488-502 (2013)
Article DOI: 10.1016/j.bmc.2013.05.067
BindingDB Entry DOI: 10.7270/Q20G3MKN