BDBM50438932 CHEMBL2420633
SMILES: FC(F)(F)c1cccc(c1)S(=O)(=O)c1ccc(CNC(=O)c2cnc3nccn3c2)cc1
InChI Key: InChIKey=MGVWDTNGPFPINJ-UHFFFAOYSA-N
Data: 1 IC50
Activity Spreadsheet -- Enzyme Inhibition Constant Data from BindingDB
Found 1 hit for monomerid = 50438932
Trg + Lig
Ki
nM
ΔG°
kcal/mole
IC50
nM
Kd
nM
EC50/IC50
nM
koff
s-1
kon
M-1s-1
pHTemp
°C
Nicotinamide phosphoribosyltransferase
(Homo sapiens (Human))
BDBM50438932
(CHEMBL2420633)
Show SMILES FC(F)(F)c1cccc(c1)S(=O)(=O)c1ccc(CNC(=O)c2cnc3nccn3c2)cc1
Show InChI InChI=1S/C21H15F3N4O3S/c22-21(23,24)16-2-1-3-18(10-16)32(30,31)17-6-4-14(5-7-17)11-26-19(29)15-12-27-20-25-8-9-28(20)13-15/h1-10,12-13H,11H2,(H,26,29)
Reactome pathway
n/an/a 1n/an/an/an/an/an/a
Forma Therapeutics, Inc.
Curated by ChEMBL
Assay Description
Inhibition of C-terminal His-tagged NAMPT (unknown origin) expressed in Escherichia coli BL21 using nicotinamide as substrate preincubated for 15 min...
J Med Chem 56: 6413-33 (2013)
Article DOI: 10.1021/jm4008664
BindingDB Entry DOI: 10.7270/Q2H996MB