BDBM50438997 CHEMBL2420680
SMILES: Oc1ccc2ccc(-c3cncc(F)c3)c(Cl)c2c1
InChI Key: InChIKey=JCEKIEMNLATOCB-UHFFFAOYSA-N
Data: 4 IC50
Activity Spreadsheet -- Enzyme Inhibition Constant Data from BindingDB
Found 4 hits for monomerid = 50438997
Trg + Lig
Ki
nM
ΔG°
kcal/mole
IC50
nM
Kd
nM
EC50/IC50
nM
koff
s-1
kon
M-1s-1
pHTemp
°C
Cytochrome P450 11B1, mitochondrial
(Homo sapiens (Human))
BDBM50438997
(CHEMBL2420680)
Show SMILES Oc1ccc2ccc(-c3cncc(F)c3)c(Cl)c2c1
Show InChI InChI=1S/C15H9ClFNO/c16-15-13(10-5-11(17)8-18-7-10)4-2-9-1-3-12(19)6-14(9)15/h1-8,19H
n/an/a 450n/an/an/an/an/an/a
Saarland University& Helmholtz Institute for Pharmaceutical Research Saarland (HIPS)
Curated by ChEMBL
Assay Description
Inhibition of human CYP11B1 expressed in hamster V79MZh cells using [1,2-3H]-11-deoxycorticosterone as substrate
J Med Chem 56: 6101-7 (2013)
Article DOI: 10.1021/jm400484p
BindingDB Entry DOI: 10.7270/Q2CJ8FX2
Cytochrome P450 19A1
(Homo sapiens (Human))
BDBM50438997
(CHEMBL2420680)
Show SMILES Oc1ccc2ccc(-c3cncc(F)c3)c(Cl)c2c1
Show InChI InChI=1S/C15H9ClFNO/c16-15-13(10-5-11(17)8-18-7-10)4-2-9-1-3-12(19)6-14(9)15/h1-8,19H
Reactome pathway
n/an/a>2.00E+3n/an/an/an/an/an/a
Saarland University& Helmholtz Institute for Pharmaceutical Research Saarland (HIPS)
Curated by ChEMBL
Assay Description
Inhibition of CYP19 in human placental microsomes using [1beta-3H]androstenedione as substrate by 3H2O-method
J Med Chem 56: 6101-7 (2013)
Article DOI: 10.1021/jm400484p
BindingDB Entry DOI: 10.7270/Q2CJ8FX2
Cytochrome P450 17A1
(Homo sapiens (Human))
BDBM50438997
(CHEMBL2420680)
Show SMILES Oc1ccc2ccc(-c3cncc(F)c3)c(Cl)c2c1
Show InChI InChI=1S/C15H9ClFNO/c16-15-13(10-5-11(17)8-18-7-10)4-2-9-1-3-12(19)6-14(9)15/h1-8,19H
Reactome pathway
n/an/a 525n/an/an/an/an/an/a
Saarland University& Helmholtz Institute for Pharmaceutical Research Saarland (HIPS)
Curated by ChEMBL
Assay Description
Inhibition of human CYP17 expressed in Escherichia coli using 1,2[3H]-progesterone as substrate in presence of NADPH
J Med Chem 56: 6101-7 (2013)
Article DOI: 10.1021/jm400484p
BindingDB Entry DOI: 10.7270/Q2CJ8FX2
Cytochrome P450 11B2 (CYP11B2)
(Homo sapiens (Human))
BDBM50438997
(CHEMBL2420680)
Show SMILES Oc1ccc2ccc(-c3cncc(F)c3)c(Cl)c2c1
Show InChI InChI=1S/C15H9ClFNO/c16-15-13(10-5-11(17)8-18-7-10)4-2-9-1-3-12(19)6-14(9)15/h1-8,19H
n/an/a 33n/an/an/an/an/an/a
Saarland University& Helmholtz Institute for Pharmaceutical Research Saarland (HIPS)
Curated by ChEMBL
Assay Description
Inhibition of human CYP11B2 expressed in hamster V79MZh cells using [1,2-3H]-11-deoxycorticosterone as substrate
J Med Chem 56: 6101-7 (2013)
Article DOI: 10.1021/jm400484p
BindingDB Entry DOI: 10.7270/Q2CJ8FX2