BDBM50439141 CHEMBL2418481
SMILES: CN1\C(S\C(=C/c2ccc(F)cc2)C1=O)=N\c1cccc(c1)C(O)=O
InChI Key: InChIKey=UCSWGGNPHWOILR-NGDANQHJSA-N
Data: 1 IC50
Activity Spreadsheet -- Enzyme Inhibition Constant Data from BindingDB
Found 1 hit for monomerid = 50439141
Trg + Lig
Ki
nM
ΔG°
kcal/mole
IC50
nM
Kd
nM
EC50/IC50
nM
koff
s-1
kon
M-1s-1
pHTemp
°C
O-acetylserine sulfhydrylase
(Mycobacterium tuberculosis)
BDBM50439141
(CHEMBL2418481)
Show SMILES CN1\C(S\C(=C/c2ccc(F)cc2)C1=O)=N\c1cccc(c1)C(O)=O
Show InChI InChI=1S/C18H13FN2O3S/c1-21-16(22)15(9-11-5-7-13(19)8-6-11)25-18(21)20-14-4-2-3-12(10-14)17(23)24/h2-10H,1H3,(H,23,24)/b15-9-,20-18-
Reactome pathway
n/an/a 19n/an/an/an/an/an/a
Karolinska Institutet
Curated by ChEMBL
Assay Description
Inhibition of Mycobacterium tuberculosis N-terminal His-6-tagged recombinant CysK1 expressed in Escherichia coli BL21 (DE3) after 20 mins by spectrop...
J Med Chem 56: 6457-66 (2013)
Article DOI: 10.1021/jm400710k
BindingDB Entry DOI: 10.7270/Q2GB25GH