BDBM50439150 CHEMBL2418545
SMILES: CCCN1\C(S\C(=C/c2ccc(O)cc2)C1=O)=N\c1cccc(c1)C(O)=O
InChI Key: InChIKey=FWOZHBMXSKBHCU-ICSPAVNMSA-N
Data: 1 IC50
Activity Spreadsheet -- Enzyme Inhibition Constant Data from BindingDB
Found 1 hit for monomerid = 50439150
Trg + Lig
Ki
nM
ΔG°
kcal/mole
IC50
nM
Kd
nM
EC50/IC50
nM
koff
s-1
kon
M-1s-1
pHTemp
°C
O-acetylserine sulfhydrylase
(Mycobacterium tuberculosis)
BDBM50439150
(CHEMBL2418545)
Show SMILES CCCN1\C(S\C(=C/c2ccc(O)cc2)C1=O)=N\c1cccc(c1)C(O)=O
Show InChI InChI=1S/C20H18N2O4S/c1-2-10-22-18(24)17(11-13-6-8-16(23)9-7-13)27-20(22)21-15-5-3-4-14(12-15)19(25)26/h3-9,11-12,23H,2,10H2,1H3,(H,25,26)/b17-11-,21-20-
Reactome pathway
n/an/a 95n/an/an/an/an/an/a
Karolinska Institutet
Curated by ChEMBL
Assay Description
Inhibition of Mycobacterium tuberculosis N-terminal His-6-tagged recombinant CysK1 expressed in Escherichia coli BL21 (DE3) after 20 mins by spectrop...
J Med Chem 56: 6457-66 (2013)
Article DOI: 10.1021/jm400710k
BindingDB Entry DOI: 10.7270/Q2GB25GH