BDBM50439250 CHEMBL2419044
SMILES: CC(C)C[C@@H](NC(=O)[C@@H]1CNC[C@@H](C1)N1CC(=O)N(CC1(C)C)c1ccccc1C)c1ccc(F)cn1
InChI Key: InChIKey=SURFEDDEQIGIAF-QQKQFIJSSA-N
Data: 3 IC50
Activity Spreadsheet -- Enzyme Inhibition Constant Data from BindingDB
Found 3 hits for monomerid = 50439250
Trg + Lig
Ki
nM
ΔG°
kcal/mole
IC50
nM
Kd
nM
EC50/IC50
nM
koff
s-1
kon
M-1s-1
pHTemp
°C
Renin
(Homo sapiens (Human))
BDBM50439250
(CHEMBL2419044)
Show SMILES CC(C)C[C@@H](NC(=O)[C@@H]1CNC[C@@H](C1)N1CC(=O)N(CC1(C)C)c1ccccc1C)c1ccc(F)cn1 |r|
Show InChI InChI=1S/C29H40FN5O2/c1-19(2)12-25(24-11-10-22(30)15-32-24)33-28(37)21-13-23(16-31-14-21)35-17-27(36)34(18-29(35,4)5)26-9-7-6-8-20(26)3/h6-11,15,19,21,23,25,31H,12-14,16-18H2,1-5H3,(H,33,37)/t21-,23+,25+/m0/s1
Reactome pathway
n/an/a 3.60n/an/an/an/an/an/a
Daiichi Sankyo Co., Ltd
Curated by ChEMBL
Assay Description
Inhibition of human plasma renin by competitive radioimmunoassay
Bioorg Med Chem 21: 5907-22 (2013)
Article DOI: 10.1016/j.bmc.2013.06.057
BindingDB Entry DOI: 10.7270/Q2TH8P4B
Renin
(Homo sapiens (Human))
BDBM50439250
(CHEMBL2419044)
Show SMILES CC(C)C[C@@H](NC(=O)[C@@H]1CNC[C@@H](C1)N1CC(=O)N(CC1(C)C)c1ccccc1C)c1ccc(F)cn1 |r|
Show InChI InChI=1S/C29H40FN5O2/c1-19(2)12-25(24-11-10-22(30)15-32-24)33-28(37)21-13-23(16-31-14-21)35-17-27(36)34(18-29(35,4)5)26-9-7-6-8-20(26)3/h6-11,15,19,21,23,25,31H,12-14,16-18H2,1-5H3,(H,33,37)/t21-,23+,25+/m0/s1
Reactome pathway
n/an/a 1.60n/an/an/an/an/an/a
Daiichi Sankyo Co., Ltd
Curated by ChEMBL
Assay Description
Inhibition of trypsin-activated human recombinant renin using (Arg-Glu(EDANS)-Ile-His-Pro-Phe-His-Leu-Val-Ile-His-Thr-Lys(DABCYL)-Arg) as substrate i...
Bioorg Med Chem 21: 5907-22 (2013)
Article DOI: 10.1016/j.bmc.2013.06.057
BindingDB Entry DOI: 10.7270/Q2TH8P4B
Renin
(Macaca fascicularis)
BDBM50439250
(CHEMBL2419044)
Show SMILES CC(C)C[C@@H](NC(=O)[C@@H]1CNC[C@@H](C1)N1CC(=O)N(CC1(C)C)c1ccccc1C)c1ccc(F)cn1 |r|
Show InChI InChI=1S/C29H40FN5O2/c1-19(2)12-25(24-11-10-22(30)15-32-24)33-28(37)21-13-23(16-31-14-21)35-17-27(36)34(18-29(35,4)5)26-9-7-6-8-20(26)3/h6-11,15,19,21,23,25,31H,12-14,16-18H2,1-5H3,(H,33,37)/t21-,23+,25+/m0/s1
n/an/a 7n/an/an/an/an/an/a
Daiichi Sankyo Co., Ltd
Curated by ChEMBL
Assay Description
Inhibition of cynomolgus monkey plasma renin assessed as angiotensin 1 level after 60 mins by competitive radioimmunoassay
Bioorg Med Chem 21: 5907-22 (2013)
Article DOI: 10.1016/j.bmc.2013.06.057
BindingDB Entry DOI: 10.7270/Q2TH8P4B