BDBM50439402 CHEMBL2420537
SMILES: CN(C)S(=O)(=O)c1cc(NC(=O)Cc2ccccc2Br)ccc1C
InChI Key: InChIKey=WNENMVAJKIKCFD-UHFFFAOYSA-N
Data: 2 EC50
Activity Spreadsheet -- Enzyme Inhibition Constant Data from BindingDB
Found 2 hits for monomerid = 50439402
Trg + Lig
Ki
nM
ΔG°
kcal/mole
IC50
nM
Kd
nM
EC50/IC50
nM
koff
s-1
kon
M-1s-1
pHTemp
°C
G protein-activated inward rectifier potassium channel 1
(Homo sapiens (Human))
BDBM50439402
(CHEMBL2420537)
Show SMILES CN(C)S(=O)(=O)c1cc(NC(=O)Cc2ccccc2Br)ccc1C
Show InChI InChI=1S/C17H19BrN2O3S/c1-12-8-9-14(11-16(12)24(22,23)20(2)3)19-17(21)10-13-6-4-5-7-15(13)18/h4-9,11H,10H2,1-3H3,(H,19,21)
Reactome pathway
n/an/an/an/a 1.40E+3n/an/an/an/a
Vanderbilt University
Curated by ChEMBL
Assay Description
Activation of GIRK1/2 (unknown origin) by cell-based thallium flux assay
Bioorg Med Chem Lett 23: 5195-8 (2013)
Article DOI: 10.1016/j.bmcl.2013.07.002
BindingDB Entry DOI: 10.7270/Q28K7BG1
G protein-activated inward rectifier potassium channel 4
(Homo sapiens (Human))
BDBM50439402
(CHEMBL2420537)
Show SMILES CN(C)S(=O)(=O)c1cc(NC(=O)Cc2ccccc2Br)ccc1C
Show InChI InChI=1S/C17H19BrN2O3S/c1-12-8-9-14(11-16(12)24(22,23)20(2)3)19-17(21)10-13-6-4-5-7-15(13)18/h4-9,11H,10H2,1-3H3,(H,19,21)
Reactome pathway
n/an/an/an/a 1.60E+3n/an/an/an/a
Vanderbilt University
Curated by ChEMBL
Assay Description
Activation of GIRK1/4 (unknown origin) by cell-based thallium flux assay
Bioorg Med Chem Lett 23: 5195-8 (2013)
Article DOI: 10.1016/j.bmcl.2013.07.002
BindingDB Entry DOI: 10.7270/Q28K7BG1