BDBM50439470 CHEMBL2417910
SMILES: COc1ccc(-c2ccc(cc2C(O)=O)C(=O)N[C@H](CO)C(C)(C)C)c(n1)C(=O)Nc1cccc(c1)C(N)=O
InChI Key: InChIKey=QOJVSMMGUMUYEI-OAQYLSRUSA-N
Data: 4 IC50
PDB links: 1 PDB ID matches this monomer.
Activity Spreadsheet -- Enzyme Inhibition Constant Data from BindingDB
Found 4 hits for monomerid = 50439470
Trg + Lig
Ki
nM
ΔG°
kcal/mole
IC50
nM
Kd
nM
EC50/IC50
nM
koff
s-1
kon
M-1s-1
pHTemp
°C
Tissue-type plasminogen activator
(Homo sapiens (Human))
BDBM50439470
(CHEMBL2417910)
Show SMILES COc1ccc(-c2ccc(cc2C(O)=O)C(=O)N[C@H](CO)C(C)(C)C)c(n1)C(=O)Nc1cccc(c1)C(N)=O |r|
Show InChI InChI=1S/C28H30N4O7/c1-28(2,3)21(14-33)31-25(35)16-8-9-18(20(13-16)27(37)38)19-10-11-22(39-4)32-23(19)26(36)30-17-7-5-6-15(12-17)24(29)34/h5-13,21,33H,14H2,1-4H3,(H2,29,34)(H,30,36)(H,31,35)(H,37,38)/t21-/m1/s1
NCI pathway
Reactome pathway
n/an/a>3.30E+4n/an/an/an/an/an/a
Bristol-Myers Squibb Research& Development
Curated by ChEMBL
Assay Description
Inhibition of human tissue plasminogen activator using spectrozyme tissue plasminogen activator as substrate after 3 mins
Bioorg Med Chem Lett 23: 5239-43 (2013)
Article DOI: 10.1016/j.bmcl.2013.06.028
BindingDB Entry DOI: 10.7270/Q2CC123C
Coagulation factor VII
(Homo sapiens (Human))
BDBM50439470
(CHEMBL2417910)
Show SMILES COc1ccc(-c2ccc(cc2C(O)=O)C(=O)N[C@H](CO)C(C)(C)C)c(n1)C(=O)Nc1cccc(c1)C(N)=O |r|
Show InChI InChI=1S/C28H30N4O7/c1-28(2,3)21(14-33)31-25(35)16-8-9-18(20(13-16)27(37)38)19-10-11-22(39-4)32-23(19)26(36)30-17-7-5-6-15(12-17)24(29)34/h5-13,21,33H,14H2,1-4H3,(H2,29,34)(H,30,36)(H,31,35)(H,37,38)/t21-/m1/s1
Reactome pathway
n/an/a 175n/an/an/an/an/an/a
Bristol-Myers Squibb Research& Development
Curated by ChEMBL
Assay Description
Inhibition of human F7a using D-Ile-Pro-Arg-AFC as substrate after 3 mins
Bioorg Med Chem Lett 23: 5239-43 (2013)
Article DOI: 10.1016/j.bmcl.2013.06.028
BindingDB Entry DOI: 10.7270/Q2CC123C
3D
3D Structure (crystal)
Coagulation factor X
(Homo sapiens (Human))
BDBM50439470
(CHEMBL2417910)
Show SMILES COc1ccc(-c2ccc(cc2C(O)=O)C(=O)N[C@H](CO)C(C)(C)C)c(n1)C(=O)Nc1cccc(c1)C(N)=O |r|
Show InChI InChI=1S/C28H30N4O7/c1-28(2,3)21(14-33)31-25(35)16-8-9-18(20(13-16)27(37)38)19-10-11-22(39-4)32-23(19)26(36)30-17-7-5-6-15(12-17)24(29)34/h5-13,21,33H,14H2,1-4H3,(H2,29,34)(H,30,36)(H,31,35)(H,37,38)/t21-/m1/s1
Reactome pathway
n/an/a>3.30E+4n/an/an/an/an/an/a
Bristol-Myers Squibb Research& Development
Curated by ChEMBL
Assay Description
Inhibition of human F10a using S-2222 as substrate after 3 mins
Bioorg Med Chem Lett 23: 5239-43 (2013)
Article DOI: 10.1016/j.bmcl.2013.06.028
BindingDB Entry DOI: 10.7270/Q2CC123C
Coagulation factor XI
(Homo sapiens (Human))
BDBM50439470
(CHEMBL2417910)
Show SMILES COc1ccc(-c2ccc(cc2C(O)=O)C(=O)N[C@H](CO)C(C)(C)C)c(n1)C(=O)Nc1cccc(c1)C(N)=O |r|
Show InChI InChI=1S/C28H30N4O7/c1-28(2,3)21(14-33)31-25(35)16-8-9-18(20(13-16)27(37)38)19-10-11-22(39-4)32-23(19)26(36)30-17-7-5-6-15(12-17)24(29)34/h5-13,21,33H,14H2,1-4H3,(H2,29,34)(H,30,36)(H,31,35)(H,37,38)/t21-/m1/s1
Reactome pathway
n/an/a>3.30E+4n/an/an/an/an/an/a
Bristol-Myers Squibb Research& Development
Curated by ChEMBL
Assay Description
Inhibition of human F11a using S-2366 as substrate after 3 mins
Bioorg Med Chem Lett 23: 5239-43 (2013)
Article DOI: 10.1016/j.bmcl.2013.06.028
BindingDB Entry DOI: 10.7270/Q2CC123C