BDBM50439474 CHEMBL2417906
SMILES: COc1ccc(-c2ccc(cc2C(O)=O)C(=O)N[C@H](CO)C(C)(C)C)c(n1)C(=O)Nc1ccc2c(N)nccc2c1
InChI Key: InChIKey=GCBXPOHPNDVIFD-HSZRJFAPSA-N
Data: 4 IC50
PDB links: 1 PDB ID matches this monomer.
Activity Spreadsheet -- Enzyme Inhibition Constant Data from BindingDB
Found 4 hits for monomerid = 50439474
Trg + Lig
Ki
nM
ΔG°
kcal/mole
IC50
nM
Kd
nM
EC50/IC50
nM
koff
s-1
kon
M-1s-1
pHTemp
°C
Tissue-type plasminogen activator
(Homo sapiens (Human))
BDBM50439474
(CHEMBL2417906)
Show SMILES COc1ccc(-c2ccc(cc2C(O)=O)C(=O)N[C@H](CO)C(C)(C)C)c(n1)C(=O)Nc1ccc2c(N)nccc2c1 |r|
Show InChI InChI=1S/C30H31N5O6/c1-30(2,3)23(15-36)34-27(37)17-5-7-20(22(14-17)29(39)40)21-9-10-24(41-4)35-25(21)28(38)33-18-6-8-19-16(13-18)11-12-32-26(19)31/h5-14,23,36H,15H2,1-4H3,(H2,31,32)(H,33,38)(H,34,37)(H,39,40)/t23-/m1/s1
NCI pathway
Reactome pathway
n/an/a>3.30E+4n/an/an/an/an/an/a
Bristol-Myers Squibb Research& Development
Curated by ChEMBL
Assay Description
Inhibition of human tissue plasminogen activator using spectrozyme tissue plasminogen activator as substrate after 3 mins
Bioorg Med Chem Lett 23: 5239-43 (2013)
Article DOI: 10.1016/j.bmcl.2013.06.028
BindingDB Entry DOI: 10.7270/Q2CC123C
Coagulation factor VII
(Homo sapiens (Human))
BDBM50439474
(CHEMBL2417906)
Show SMILES COc1ccc(-c2ccc(cc2C(O)=O)C(=O)N[C@H](CO)C(C)(C)C)c(n1)C(=O)Nc1ccc2c(N)nccc2c1 |r|
Show InChI InChI=1S/C30H31N5O6/c1-30(2,3)23(15-36)34-27(37)17-5-7-20(22(14-17)29(39)40)21-9-10-24(41-4)35-25(21)28(38)33-18-6-8-19-16(13-18)11-12-32-26(19)31/h5-14,23,36H,15H2,1-4H3,(H2,31,32)(H,33,38)(H,34,37)(H,39,40)/t23-/m1/s1
Reactome pathway
n/an/a 7n/an/an/an/an/an/a
Bristol-Myers Squibb Research& Development
Curated by ChEMBL
Assay Description
Inhibition of human F7a using D-Ile-Pro-Arg-AFC as substrate after 3 mins
Bioorg Med Chem Lett 23: 5239-43 (2013)
Article DOI: 10.1016/j.bmcl.2013.06.028
BindingDB Entry DOI: 10.7270/Q2CC123C
3D
3D Structure (crystal)
Coagulation factor X
(Homo sapiens (Human))
BDBM50439474
(CHEMBL2417906)
Show SMILES COc1ccc(-c2ccc(cc2C(O)=O)C(=O)N[C@H](CO)C(C)(C)C)c(n1)C(=O)Nc1ccc2c(N)nccc2c1 |r|
Show InChI InChI=1S/C30H31N5O6/c1-30(2,3)23(15-36)34-27(37)17-5-7-20(22(14-17)29(39)40)21-9-10-24(41-4)35-25(21)28(38)33-18-6-8-19-16(13-18)11-12-32-26(19)31/h5-14,23,36H,15H2,1-4H3,(H2,31,32)(H,33,38)(H,34,37)(H,39,40)/t23-/m1/s1
Reactome pathway
n/an/a 270n/an/an/an/an/an/a
Bristol-Myers Squibb Research& Development
Curated by ChEMBL
Assay Description
Inhibition of human F10a using S-2222 as substrate after 3 mins
Bioorg Med Chem Lett 23: 5239-43 (2013)
Article DOI: 10.1016/j.bmcl.2013.06.028
BindingDB Entry DOI: 10.7270/Q2CC123C
Coagulation factor XI
(Homo sapiens (Human))
BDBM50439474
(CHEMBL2417906)
Show SMILES COc1ccc(-c2ccc(cc2C(O)=O)C(=O)N[C@H](CO)C(C)(C)C)c(n1)C(=O)Nc1ccc2c(N)nccc2c1 |r|
Show InChI InChI=1S/C30H31N5O6/c1-30(2,3)23(15-36)34-27(37)17-5-7-20(22(14-17)29(39)40)21-9-10-24(41-4)35-25(21)28(38)33-18-6-8-19-16(13-18)11-12-32-26(19)31/h5-14,23,36H,15H2,1-4H3,(H2,31,32)(H,33,38)(H,34,37)(H,39,40)/t23-/m1/s1
Reactome pathway
n/an/a 1.09E+4n/an/an/an/an/an/a
Bristol-Myers Squibb Research& Development
Curated by ChEMBL
Assay Description
Inhibition of human F11a using S-2366 as substrate after 3 mins
Bioorg Med Chem Lett 23: 5239-43 (2013)
Article DOI: 10.1016/j.bmcl.2013.06.028
BindingDB Entry DOI: 10.7270/Q2CC123C