BDBM50439560 CHEMBL1967252
SMILES: Cc1n[nH]c2ccc(cc12)-c1cccnc1
InChI Key: InChIKey=HXESDBWWDYJEJQ-UHFFFAOYSA-N
Data: 1 IC50
Activity Spreadsheet -- Enzyme Inhibition Constant Data from BindingDB
Found 1 hit for monomerid = 50439560
Trg + Lig
Ki
nM
ΔG°
kcal/mole
IC50
nM
Kd
nM
EC50/IC50
nM
koff
s-1
kon
M-1s-1
pHTemp
°C
Cyclin-dependent kinase 9
(Homo sapiens (Human))
BDBM50439560
(CHEMBL1967252)
Show SMILES Cc1n[nH]c2ccc(cc12)-c1cccnc1
Show InChI InChI=1S/C13H11N3/c1-9-12-7-10(4-5-13(12)16-15-9)11-3-2-6-14-8-11/h2-8H,1H3,(H,15,16)
Reactome pathway
n/an/a 631n/an/an/an/an/an/a
Lilly Research Laboratories
Curated by ChEMBL
Assay Description
Inhibition of CDK9 (unknown origin)
J Med Chem 56: 6991-7002 (2013)
Article DOI: 10.1021/jm400798j
BindingDB Entry DOI: 10.7270/Q2G44RQC