BDBM50439608 CHEMBL2419300
SMILES: CC1NC(=O)C(=C1c1cc(Cl)c2OCC(=O)Nc2c1)c1ccc(F)cc1
InChI Key: InChIKey=XWXVDWUFOLWWBG-UHFFFAOYSA-N
Data: 4 IC50
Activity Spreadsheet -- Enzyme Inhibition Constant Data from BindingDB
Found 4 hits for monomerid = 50439608
Trg + Lig
Ki
nM
ΔG°
kcal/mole
IC50
nM
Kd
nM
EC50/IC50
nM
koff
s-1
kon
M-1s-1
pHTemp
°C
Mineralocorticoid receptor
(Homo sapiens (Human))
BDBM50439608
(CHEMBL2419300)
Show SMILES CC1NC(=O)C(=C1c1cc(Cl)c2OCC(=O)Nc2c1)c1ccc(F)cc1 |c:5|
Show InChI InChI=1S/C19H14ClFN2O3/c1-9-16(17(19(25)22-9)10-2-4-12(21)5-3-10)11-6-13(20)18-14(7-11)23-15(24)8-26-18/h2-7,9H,8H2,1H3,(H,22,25)(H,23,24)
n/an/a 23n/an/an/an/an/an/a
Takeda Pharmaceutical Company Limited
Curated by ChEMBL
Assay Description
Displacement of [3H]-Aldosterone from human MR expressed in 293 cells after 16 hrs by scintillation counting
Bioorg Med Chem 21: 5983-94 (2013)
Article DOI: 10.1016/j.bmc.2013.07.043
BindingDB Entry DOI: 10.7270/Q2TD9ZSH
Glucocorticoid receptor
(Homo sapiens (Human))
BDBM50439608
(CHEMBL2419300)
Show SMILES CC1NC(=O)C(=C1c1cc(Cl)c2OCC(=O)Nc2c1)c1ccc(F)cc1 |c:5|
Show InChI InChI=1S/C19H14ClFN2O3/c1-9-16(17(19(25)22-9)10-2-4-12(21)5-3-10)11-6-13(20)18-14(7-11)23-15(24)8-26-18/h2-7,9H,8H2,1H3,(H,22,25)(H,23,24)
n/an/a 1.10E+3n/an/an/an/an/an/a
Takeda Pharmaceutical Company Limited
Curated by ChEMBL
Assay Description
Displacement of [3H]-Dexamethasone human GR expressed in 293 cells after 16 hrs by scintillation counting
Bioorg Med Chem 21: 5983-94 (2013)
Article DOI: 10.1016/j.bmc.2013.07.043
BindingDB Entry DOI: 10.7270/Q2TD9ZSH
Androgen Receptor
(Homo sapiens (Human))
BDBM50439608
(CHEMBL2419300)
Show SMILES CC1NC(=O)C(=C1c1cc(Cl)c2OCC(=O)Nc2c1)c1ccc(F)cc1 |c:5|
Show InChI InChI=1S/C19H14ClFN2O3/c1-9-16(17(19(25)22-9)10-2-4-12(21)5-3-10)11-6-13(20)18-14(7-11)23-15(24)8-26-18/h2-7,9H,8H2,1H3,(H,22,25)(H,23,24)
NCI pathway
Reactome pathway
n/an/a>1.00E+4n/an/an/an/an/an/a
Takeda Pharmaceutical Company Limited
Curated by ChEMBL
Assay Description
Displacement of [3H]-Testosterone from human AR expressed in 293 cells after 16 hrs by scintillation counting
Bioorg Med Chem 21: 5983-94 (2013)
Article DOI: 10.1016/j.bmc.2013.07.043
BindingDB Entry DOI: 10.7270/Q2TD9ZSH
Progesterone receptor
(Homo sapiens (Human))
BDBM50439608
(CHEMBL2419300)
Show SMILES CC1NC(=O)C(=C1c1cc(Cl)c2OCC(=O)Nc2c1)c1ccc(F)cc1 |c:5|
Show InChI InChI=1S/C19H14ClFN2O3/c1-9-16(17(19(25)22-9)10-2-4-12(21)5-3-10)11-6-13(20)18-14(7-11)23-15(24)8-26-18/h2-7,9H,8H2,1H3,(H,22,25)(H,23,24)
n/an/a 1.60E+3n/an/an/an/an/an/a
Takeda Pharmaceutical Company Limited
Curated by ChEMBL
Assay Description
Displacement of [3H]-Progesterone from human PR expressed in 293 cells after 16 hrs by scintillation counting
Bioorg Med Chem 21: 5983-94 (2013)
Article DOI: 10.1016/j.bmc.2013.07.043
BindingDB Entry DOI: 10.7270/Q2TD9ZSH