BDBM50439621 GANETESPIB::STA-9090
SMILES: CC(C)c1cc(-c2n[nH]c(=O)n2-c2ccc3n(C)ccc3c2)c(O)cc1O
InChI Key: InChIKey=RVAQIUULWULRNW-UHFFFAOYSA-N
Data: 7 IC50  1 Kd
PDB links: 2 PDB IDs match this monomer.
Activity Spreadsheet -- Enzyme Inhibition Constant Data from BindingDB
Found 8 hits for monomerid = 50439621
Trg + Lig
Ki
nM
ΔG°
kcal/mole
IC50
nM
Kd
nM
EC50/IC50
nM
koff
s-1
kon
M-1s-1
pHTemp
°C
Heat shock protein 75 kDa, mitochondrial
(Homo sapiens (Human))
BDBM50439621
(GANETESPIB | STA-9090)
Show SMILES CC(C)c1cc(-c2n[nH]c(=O)n2-c2ccc3n(C)ccc3c2)c(O)cc1O
Show InChI InChI=1S/C20H20N4O3/c1-11(2)14-9-15(18(26)10-17(14)25)19-21-22-20(27)24(19)13-4-5-16-12(8-13)6-7-23(16)3/h4-11,25-26H,1-3H3,(H,22,27)
n/an/a 51n/an/an/an/an/an/a
Memorial Sloan-Kettering Cancer Center
Curated by ChEMBL
Assay Description
Displacement of 5-(3-(3-(6-amino-8-(6-iodobenzo[d][1,3]dioxol-5-ylthio)-9H-purin-9-yl)propyl)thioureido)-2-(6-hydroxy-3-oxo-3H-xanthen-9-yl)benzoic a...
J Med Chem 56: 6803-18 (2013)
Article DOI: 10.1021/jm400619b
BindingDB Entry DOI: 10.7270/Q2PN972K
Endoplasmin
(Canis familiaris)
BDBM50439621
(GANETESPIB | STA-9090)
Show SMILES CC(C)c1cc(-c2n[nH]c(=O)n2-c2ccc3n(C)ccc3c2)c(O)cc1O
Show InChI InChI=1S/C20H20N4O3/c1-11(2)14-9-15(18(26)10-17(14)25)19-21-22-20(27)24(19)13-4-5-16-12(8-13)6-7-23(16)3/h4-11,25-26H,1-3H3,(H,22,27)
Reactome pathway
n/an/a 10n/an/an/an/an/an/a
Memorial Sloan-Kettering Cancer Center
Curated by ChEMBL
Assay Description
Displacement of 5-(3-(3-(6-amino-8-(6-iodobenzo[d][1,3]dioxol-5-ylthio)-9H-purin-9-yl)propyl)thioureido)-2-(6-hydroxy-3-oxo-3H-xanthen-9-yl)benzoic a...
J Med Chem 56: 6803-18 (2013)
Article DOI: 10.1021/jm400619b
BindingDB Entry DOI: 10.7270/Q2PN972K
Heat shock protein HSP 90-alpha/90-beta
(Homo sapiens (Human))
BDBM50439621
(GANETESPIB | STA-9090)
Show SMILES CC(C)c1cc(-c2n[nH]c(=O)n2-c2ccc3n(C)ccc3c2)c(O)cc1O
Show InChI InChI=1S/C20H20N4O3/c1-11(2)14-9-15(18(26)10-17(14)25)19-21-22-20(27)24(19)13-4-5-16-12(8-13)6-7-23(16)3/h4-11,25-26H,1-3H3,(H,22,27)
Reactome pathway
n/an/a 63n/an/an/an/an/an/a
Chinese Academy of Sciences
Curated by ChEMBL
Assay Description
Inhibition of Hsp90 in human MG63 cells
J Med Chem 59: 5563-86 (2016)
Article DOI: 10.1021/acs.jmedchem.5b01106
3D
3D Structure (crystal)
Heat shock protein HSP 90-alpha/90-beta
(Homo sapiens (Human))
BDBM50439621
(GANETESPIB | STA-9090)
Show SMILES CC(C)c1cc(-c2n[nH]c(=O)n2-c2ccc3n(C)ccc3c2)c(O)cc1O
Show InChI InChI=1S/C20H20N4O3/c1-11(2)14-9-15(18(26)10-17(14)25)19-21-22-20(27)24(19)13-4-5-16-12(8-13)6-7-23(16)3/h4-11,25-26H,1-3H3,(H,22,27)
Reactome pathway
n/an/an/a 24n/an/an/an/an/a
Fujian Medical University (FMU)
Curated by ChEMBL
Assay Description
Binding affinity to HSP90 (unknown origin) by fluorescence quenching method
Bioorg Med Chem 28: (2020)
3D
3D Structure (crystal)
Heat shock protein HSP 90-alpha
(Homo sapiens (Human))
BDBM50439621
(GANETESPIB | STA-9090)
Show SMILES CC(C)c1cc(-c2n[nH]c(=O)n2-c2ccc3n(C)ccc3c2)c(O)cc1O
Show InChI InChI=1S/C20H20N4O3/c1-11(2)14-9-15(18(26)10-17(14)25)19-21-22-20(27)24(19)13-4-5-16-12(8-13)6-7-23(16)3/h4-11,25-26H,1-3H3,(H,22,27)
NCI pathway
Reactome pathway
n/an/a 50n/an/an/an/an/an/a
Daegu-Gyeongbuk Medical Innovation Foundation (DGMIF)
Curated by ChEMBL
Assay Description
Inhibition of recombinant HSP90alpha (unknown origin) incubated for 24 hrs in presence of 1-FITC3 probe by fluorescence polarization assay
Bioorg Med Chem Lett 30: (2020)
3D
3D Structure (crystal)
Heat shock protein 75 kDa, mitochondrial
(Homo sapiens (Human))
BDBM50439621
(GANETESPIB | STA-9090)
Show SMILES CC(C)c1cc(-c2n[nH]c(=O)n2-c2ccc3n(C)ccc3c2)c(O)cc1O
Show InChI InChI=1S/C20H20N4O3/c1-11(2)14-9-15(18(26)10-17(14)25)19-21-22-20(27)24(19)13-4-5-16-12(8-13)6-7-23(16)3/h4-11,25-26H,1-3H3,(H,22,27)
n/an/a 38n/an/an/an/an/an/a
Daegu-Gyeongbuk Medical Innovation Foundation (DGMIF)
Curated by ChEMBL
Assay Description
Inhibition of TRAP1 (unknown origin)
Bioorg Med Chem Lett 30: (2020)
Endoplasmin
(Homo sapiens (Human))
BDBM50439621
(GANETESPIB | STA-9090)
Show SMILES CC(C)c1cc(-c2n[nH]c(=O)n2-c2ccc3n(C)ccc3c2)c(O)cc1O
Show InChI InChI=1S/C20H20N4O3/c1-11(2)14-9-15(18(26)10-17(14)25)19-21-22-20(27)24(19)13-4-5-16-12(8-13)6-7-23(16)3/h4-11,25-26H,1-3H3,(H,22,27)
n/an/a 38n/an/an/an/an/an/a
Daegu-Gyeongbuk Medical Innovation Foundation (DGMIF)
Curated by ChEMBL
Assay Description
Inhibition of GRP94 (unknown origin)
Bioorg Med Chem Lett 30: (2020)
Heat shock protein HSP 90-alpha/90-beta
(Homo sapiens (Human))
BDBM50439621
(GANETESPIB | STA-9090)
Show SMILES CC(C)c1cc(-c2n[nH]c(=O)n2-c2ccc3n(C)ccc3c2)c(O)cc1O
Show InChI InChI=1S/C20H20N4O3/c1-11(2)14-9-15(18(26)10-17(14)25)19-21-22-20(27)24(19)13-4-5-16-12(8-13)6-7-23(16)3/h4-11,25-26H,1-3H3,(H,22,27)
Reactome pathway
n/an/a 63n/an/an/an/an/an/a
Chinese Academy of Sciences
Curated by ChEMBL
Assay Description
Inhibition of Hsp90 in human MG63 cells
J Med Chem 59: 5563-86 (2016)
Article DOI: 10.1021/acs.jmedchem.5b01106
3D
3D Structure (crystal)