BDBM50439635 CHEMBL2419594::US8993586, 88
SMILES: CC(C)(C)n1cc2CC3(CCN(CC3)C(=O)c3cnc4c(Cl)c[nH]c4c3)NC(=O)c2n1
InChI Key: InChIKey=OGEMYMVKDPFQRH-UHFFFAOYSA-N
Data: 4 IC50
Activity Spreadsheet -- Enzyme Inhibition Constant Data from BindingDB
Found 4 hits for monomerid = 50439635
Trg + Lig
Ki
nM
ΔG°
kcal/mole
IC50
nM
Kd
nM
EC50/IC50
nM
koff
s-1
kon
M-1s-1
pHTemp
°C
Acetyl-CoA carboxylase 1 (ACC1)
(Homo sapiens (Human))
BDBM50439635
(CHEMBL2419594 | US8993586, 88)
Show SMILES CC(C)(C)n1cc2CC3(CCN(CC3)C(=O)c3cnc4c(Cl)c[nH]c4c3)NC(=O)c2n1
Show InChI InChI=1S/C22H25ClN6O2/c1-21(2,3)29-12-14-9-22(26-19(30)17(14)27-29)4-6-28(7-5-22)20(31)13-8-16-18(25-10-13)15(23)11-24-16/h8,10-12,24H,4-7,9H2,1-3H3,(H,26,30)
US Patent
n/an/a 19n/an/an/an/a7.5n/a
Pfizer Inc.
US Patent
Assay Description
Preparation of rhACC1. Two liters of SF9 cells, infected with recombinant baculovirus containing full length human ACC1 cDNA, were suspended in ice-c...
US Patent US8993586 (2015)
BindingDB Entry DOI: 10.7270/Q2N58K43
Acetyl-CoA carboxylase 2 (ACC2)
(Homo sapiens (Human))
BDBM50439635
(CHEMBL2419594 | US8993586, 88)
Show SMILES CC(C)(C)n1cc2CC3(CCN(CC3)C(=O)c3cnc4c(Cl)c[nH]c4c3)NC(=O)c2n1
Show InChI InChI=1S/C22H25ClN6O2/c1-21(2,3)29-12-14-9-22(26-19(30)17(14)27-29)4-6-28(7-5-22)20(31)13-8-16-18(25-10-13)15(23)11-24-16/h8,10-12,24H,4-7,9H2,1-3H3,(H,26,30)
Reactome pathway
n/an/a 5n/an/an/an/an/an/a
Pfizer Inc.
Curated by ChEMBL
Assay Description
Inhibition of human ACC2 using acetyl-CoA as substrate assessed as [14C]malonyl-CoA synthesis preincubated for 10 mins prior to substrate addition me...
J Med Chem 56: 7110-9 (2013)
Article DOI: 10.1021/jm401033t
BindingDB Entry DOI: 10.7270/Q2JW8G9D
Acetyl-CoA carboxylase 1 (ACC1)
(Homo sapiens (Human))
BDBM50439635
(CHEMBL2419594 | US8993586, 88)
Show SMILES CC(C)(C)n1cc2CC3(CCN(CC3)C(=O)c3cnc4c(Cl)c[nH]c4c3)NC(=O)c2n1
Show InChI InChI=1S/C22H25ClN6O2/c1-21(2,3)29-12-14-9-22(26-19(30)17(14)27-29)4-6-28(7-5-22)20(31)13-8-16-18(25-10-13)15(23)11-24-16/h8,10-12,24H,4-7,9H2,1-3H3,(H,26,30)
n/an/a 11n/an/an/an/an/an/a
Pfizer Inc.
Curated by ChEMBL
Assay Description
Inhibition of human ACC1 using acetyl-CoA as substrate assessed as [14C]malonyl-CoA synthesis preincubated for 10 mins prior to substrate addition me...
J Med Chem 56: 7110-9 (2013)
Article DOI: 10.1021/jm401033t
BindingDB Entry DOI: 10.7270/Q2JW8G9D
Acetyl-CoA carboxylase 2 (ACC2)
(Homo sapiens (Human))
BDBM50439635
(CHEMBL2419594 | US8993586, 88)
Show SMILES CC(C)(C)n1cc2CC3(CCN(CC3)C(=O)c3cnc4c(Cl)c[nH]c4c3)NC(=O)c2n1
Show InChI InChI=1S/C22H25ClN6O2/c1-21(2,3)29-12-14-9-22(26-19(30)17(14)27-29)4-6-28(7-5-22)20(31)13-8-16-18(25-10-13)15(23)11-24-16/h8,10-12,24H,4-7,9H2,1-3H3,(H,26,30)
Reactome pathway
US Patent
n/an/a 4.20n/an/an/an/an/an/a
Pfizer Inc.
US Patent
Assay Description
Preparation of rhACC2. Human ACC2 inhibition was measured using purified recombinant human ACC2 (hrACC2). Briefly, a full length Cytomax clone of ACC...
US Patent US8993586 (2015)
BindingDB Entry DOI: 10.7270/Q2N58K43