null
SMILES: COCCNCCC(=O)Nc1ccc(-c2cccc3c2oc(cc3=O)N2CCOCC2)c2sc3ccccc3c12
InChI Key: InChIKey=GJMKHWCAKYEQGN-UHFFFAOYSA-N
Activity Spreadsheet -- Enzyme Inhibition Constant Data from BindingDB
Found 1 hit for monomerid = 50439923
Trg + Lig
Ki
nM
ΔG°
kcal/mole
IC50
nM
Kd
nM
EC50/IC50
nM
koff
s-1
kon
M-1s-1
pHTemp
°C
DNA-dependent protein kinase catalytic subunit
(Homo sapiens (Human))
BDBM50439923
(CHEMBL2420303)
Show SMILES COCCNCCC(=O)Nc1ccc(-c2cccc3c2oc(cc3=O)N2CCOCC2)c2sc3ccccc3c12
Show InChI InChI=1S/C31H31N3O5S/c1-37-16-13-32-12-11-27(36)33-24-10-9-21(31-29(24)23-5-2-3-8-26(23)40-31)20-6-4-7-22-25(35)19-28(39-30(20)22)34-14-17-38-18-15-34/h2-10,19,32H,11-18H2,1H3,(H,33,36)
n/an/a 8n/an/an/an/an/an/a
Newcastle University
Curated by ChEMBL
Assay Description
Inhibition of human DNA-PK using GST-tagged p53N66 as substrate after 1 hr by ELISA-based chemiluminiscence assay
J Med Chem 56: 6386-401 (2013)
Article DOI: 10.1021/jm400915j
BindingDB Entry DOI: 10.7270/Q2RF5WFD