null
SMILES: COCCNCC(=O)Nc1ccc(-c2cccc3c2oc(cc3=O)N2CCOCC2)c2sc3ccccc3c12
InChI Key: InChIKey=SMLDRHPEJUFSJJ-UHFFFAOYSA-N
Activity Spreadsheet -- Enzyme Inhibition Constant Data from BindingDB
Found 1 hit for monomerid = 50439929
Trg + Lig
Ki
nM
ΔG°
kcal/mole
IC50
nM
Kd
nM
EC50/IC50
nM
koff
s-1
kon
M-1s-1
pHTemp
°C
DNA-dependent protein kinase catalytic subunit
(Homo sapiens (Human))
BDBM50439929
(CHEMBL2420443)
Show SMILES COCCNCC(=O)Nc1ccc(-c2cccc3c2oc(cc3=O)N2CCOCC2)c2sc3ccccc3c12
Show InChI InChI=1S/C30H29N3O5S/c1-36-14-11-31-18-26(35)32-23-10-9-20(30-28(23)22-5-2-3-8-25(22)39-30)19-6-4-7-21-24(34)17-27(38-29(19)21)33-12-15-37-16-13-33/h2-10,17,31H,11-16,18H2,1H3,(H,32,35)
n/an/a 7n/an/an/an/an/an/a
Newcastle University
Curated by ChEMBL
Assay Description
Inhibition of human DNA-PK using GST-tagged p53N66 as substrate after 1 hr by ELISA-based chemiluminiscence assay
J Med Chem 56: 6386-401 (2013)
Article DOI: 10.1021/jm400915j
BindingDB Entry DOI: 10.7270/Q2RF5WFD