BDBM50440042 CHEMBL2425819
SMILES: COc1ccc(C(=O)Nc2cc(Br)cc3c2oc(cc3=O)C(O)=O)c(F)c1
InChI Key: InChIKey=WLZBCJBUOLWPFY-UHFFFAOYSA-N
Data: 1 KI  1 EC50
Activity Spreadsheet -- Enzyme Inhibition Constant Data from BindingDB
Found 2 hits for monomerid = 50440042
Trg + Lig
Ki
nM
ΔG°
kcal/mole
IC50
nM
Kd
nM
EC50/IC50
nM
koff
s-1
kon
M-1s-1
pHTemp
°C
G-protein coupled receptor 35
(Homo sapiens (Human))
BDBM50440042
(CHEMBL2425819)
Show SMILES COc1ccc(C(=O)Nc2cc(Br)cc3c2oc(cc3=O)C(O)=O)c(F)c1
Show InChI InChI=1S/C18H11BrFNO6/c1-26-9-2-3-10(12(20)6-9)17(23)21-13-5-8(19)4-11-14(22)7-15(18(24)25)27-16(11)13/h2-7H,1H3,(H,21,23)(H,24,25)
1.40n/an/an/an/an/an/an/an/a
University of Bonn
Curated by ChEMBL
Assay Description
Displacement of [3H]PSB-13253 from human recombinant GPR35 exprssed in CHO cells by liquid scintillation counting analysis
J Med Chem 56: 7084-99 (2013)
Checked by Author
Article DOI: 10.1021/jm4009373
BindingDB Entry DOI: 10.7270/Q2G16280
G-protein coupled receptor 35
(Homo sapiens (Human))
BDBM50440042
(CHEMBL2425819)
Show SMILES COc1ccc(C(=O)Nc2cc(Br)cc3c2oc(cc3=O)C(O)=O)c(F)c1
Show InChI InChI=1S/C18H11BrFNO6/c1-26-9-2-3-10(12(20)6-9)17(23)21-13-5-8(19)4-11-14(22)7-15(18(24)25)27-16(11)13/h2-7H,1H3,(H,21,23)(H,24,25)
n/an/an/an/a 4.5n/an/an/an/a
University of Bonn
Curated by ChEMBL
Assay Description
Agonist activity at C-terminal beta-galactosidase tagged human recombinant GPR35 expressed in CHO cells after 90 mins by beta-arrestin recruitment as...
J Med Chem 56: 7084-99 (2013)
Checked by Author
Article DOI: 10.1021/jm4009373
BindingDB Entry DOI: 10.7270/Q2G16280