BDBM50440060 CHEMBL2426081
SMILES: OC(=O)CCC(=O)N1N=C(C[C@H]1c1ccc(Cl)cc1)c1c(-c2ccc(Cl)cc2)c2ccccc2[nH]c1=O
InChI Key: InChIKey=PXQFOMCFQUXMBP-QHCPKHFHSA-N
Data: 4 IC50
Activity Spreadsheet -- Enzyme Inhibition Constant Data from BindingDB
Found 4 hits for monomerid = 50440060
Trg + Lig
Ki
nM
ΔG°
kcal/mole
IC50
nM
Kd
nM
EC50/IC50
nM
koff
s-1
kon
M-1s-1
pHTemp
°C
Glutamate receptor ionotropic, NMDA 2D
(Rattus norvegicus (Rat))
BDBM50440060
(CHEMBL2426081)
Show SMILES OC(=O)CCC(=O)N1N=C(C[C@H]1c1ccc(Cl)cc1)c1c(-c2ccc(Cl)cc2)c2ccccc2[nH]c1=O |r,c:8|
Show InChI InChI=1S/C28H21Cl2N3O4/c29-18-9-5-16(6-10-18)23-15-22(32-33(23)24(34)13-14-25(35)36)27-26(17-7-11-19(30)12-8-17)20-3-1-2-4-21(20)31-28(27)37/h1-12,23H,13-15H2,(H,31,37)(H,35,36)/t23-/m0/s1
n/an/a 170n/an/an/an/an/an/a
Emory University
Curated by ChEMBL
Assay Description
Negative allosteric modulation of recombinant rat GluN2D receptor expressed in Xenopus laevis oocytes by two-electrode voltage clamp method
J Med Chem 56: 6434-56 (2013)
Article DOI: 10.1021/jm400652r
BindingDB Entry DOI: 10.7270/Q26H4JTJ
NMDA receptor subunit N2A (GluN2A)
(Rattus norvegicus (Rat))
BDBM50440060
(CHEMBL2426081)
Show SMILES OC(=O)CCC(=O)N1N=C(C[C@H]1c1ccc(Cl)cc1)c1c(-c2ccc(Cl)cc2)c2ccccc2[nH]c1=O |r,c:8|
Show InChI InChI=1S/C28H21Cl2N3O4/c29-18-9-5-16(6-10-18)23-15-22(32-33(23)24(34)13-14-25(35)36)27-26(17-7-11-19(30)12-8-17)20-3-1-2-4-21(20)31-28(27)37/h1-12,23H,13-15H2,(H,31,37)(H,35,36)/t23-/m0/s1
n/an/a 1.30E+4n/an/an/an/an/an/a
Emory University
Curated by ChEMBL
Assay Description
Negative allosteric modulation of recombinant rat GluN2A receptor expressed in Xenopus laevis oocytes by two-electrode voltage clamp method
J Med Chem 56: 6434-56 (2013)
Article DOI: 10.1021/jm400652r
BindingDB Entry DOI: 10.7270/Q26H4JTJ
Glutamate receptor ionotropic, NMDA 2B
(Rattus norvegicus (Rat))
BDBM50440060
(CHEMBL2426081)
Show SMILES OC(=O)CCC(=O)N1N=C(C[C@H]1c1ccc(Cl)cc1)c1c(-c2ccc(Cl)cc2)c2ccccc2[nH]c1=O |r,c:8|
Show InChI InChI=1S/C28H21Cl2N3O4/c29-18-9-5-16(6-10-18)23-15-22(32-33(23)24(34)13-14-25(35)36)27-26(17-7-11-19(30)12-8-17)20-3-1-2-4-21(20)31-28(27)37/h1-12,23H,13-15H2,(H,31,37)(H,35,36)/t23-/m0/s1
n/an/a 2.60E+4n/an/an/an/an/an/a
Emory University
Curated by ChEMBL
Assay Description
Negative allosteric modulation of recombinant rat GluN2B receptor expressed in Xenopus laevis oocytes by two-electrode voltage clamp method
J Med Chem 56: 6434-56 (2013)
Article DOI: 10.1021/jm400652r
BindingDB Entry DOI: 10.7270/Q26H4JTJ
NMDA receptor subunit 2C (GluN2C)
(Rattus norvegicus (Rat))
BDBM50440060
(CHEMBL2426081)
Show SMILES OC(=O)CCC(=O)N1N=C(C[C@H]1c1ccc(Cl)cc1)c1c(-c2ccc(Cl)cc2)c2ccccc2[nH]c1=O |r,c:8|
Show InChI InChI=1S/C28H21Cl2N3O4/c29-18-9-5-16(6-10-18)23-15-22(32-33(23)24(34)13-14-25(35)36)27-26(17-7-11-19(30)12-8-17)20-3-1-2-4-21(20)31-28(27)37/h1-12,23H,13-15H2,(H,31,37)(H,35,36)/t23-/m0/s1
n/an/a 220n/an/an/an/an/an/a
Emory University
Curated by ChEMBL
Assay Description
Negative allosteric modulation of recombinant rat GluN2C receptor expressed in Xenopus laevis oocytes by two-electrode voltage clamp method
J Med Chem 56: 6434-56 (2013)
Article DOI: 10.1021/jm400652r
BindingDB Entry DOI: 10.7270/Q26H4JTJ