BDBM50440079 CHEMBL2426099
SMILES: OC(=O)CCC(=O)N1N=C(CC1c1ccccc1)c1c(-c2ccc(Cl)cc2)c2ccccc2[nH]c1=O
InChI Key: InChIKey=WVSSRUDJYABJLP-UHFFFAOYSA-N
Data: 4 IC50
Activity Spreadsheet -- Enzyme Inhibition Constant Data from BindingDB
Found 4 hits for monomerid = 50440079
Trg + Lig
Ki
nM
ΔG°
kcal/mole
IC50
nM
Kd
nM
EC50/IC50
nM
koff
s-1
kon
M-1s-1
pHTemp
°C
Glutamate receptor ionotropic, NMDA 2D
(Rattus norvegicus (Rat))
BDBM50440079
(CHEMBL2426099)
Show SMILES OC(=O)CCC(=O)N1N=C(CC1c1ccccc1)c1c(-c2ccc(Cl)cc2)c2ccccc2[nH]c1=O |c:8|
Show InChI InChI=1S/C28H22ClN3O4/c29-19-12-10-18(11-13-19)26-20-8-4-5-9-21(20)30-28(36)27(26)22-16-23(17-6-2-1-3-7-17)32(31-22)24(33)14-15-25(34)35/h1-13,23H,14-16H2,(H,30,36)(H,34,35)
n/an/a 1.10E+4n/an/an/an/an/an/a
Emory University
Curated by ChEMBL
Assay Description
Negative allosteric modulation of recombinant rat GluN2D receptor expressed in Xenopus laevis oocytes by two-electrode voltage clamp method
J Med Chem 56: 6434-56 (2013)
Article DOI: 10.1021/jm400652r
BindingDB Entry DOI: 10.7270/Q26H4JTJ
NMDA receptor subunit N2A (GluN2A)
(Rattus norvegicus (Rat))
BDBM50440079
(CHEMBL2426099)
Show SMILES OC(=O)CCC(=O)N1N=C(CC1c1ccccc1)c1c(-c2ccc(Cl)cc2)c2ccccc2[nH]c1=O |c:8|
Show InChI InChI=1S/C28H22ClN3O4/c29-19-12-10-18(11-13-19)26-20-8-4-5-9-21(20)30-28(36)27(26)22-16-23(17-6-2-1-3-7-17)32(31-22)24(33)14-15-25(34)35/h1-13,23H,14-16H2,(H,30,36)(H,34,35)
n/an/a 4.90E+4n/an/an/an/an/an/a
Emory University
Curated by ChEMBL
Assay Description
Negative allosteric modulation of recombinant rat GluN2A receptor expressed in Xenopus laevis oocytes by two-electrode voltage clamp method
J Med Chem 56: 6434-56 (2013)
Article DOI: 10.1021/jm400652r
BindingDB Entry DOI: 10.7270/Q26H4JTJ
Glutamate receptor ionotropic, NMDA 2B
(Rattus norvegicus (Rat))
BDBM50440079
(CHEMBL2426099)
Show SMILES OC(=O)CCC(=O)N1N=C(CC1c1ccccc1)c1c(-c2ccc(Cl)cc2)c2ccccc2[nH]c1=O |c:8|
Show InChI InChI=1S/C28H22ClN3O4/c29-19-12-10-18(11-13-19)26-20-8-4-5-9-21(20)30-28(36)27(26)22-16-23(17-6-2-1-3-7-17)32(31-22)24(33)14-15-25(34)35/h1-13,23H,14-16H2,(H,30,36)(H,34,35)
n/an/a 1.43E+5n/an/an/an/an/an/a
Emory University
Curated by ChEMBL
Assay Description
Negative allosteric modulation of recombinant rat GluN2B receptor expressed in Xenopus laevis oocytes by two-electrode voltage clamp method
J Med Chem 56: 6434-56 (2013)
Article DOI: 10.1021/jm400652r
BindingDB Entry DOI: 10.7270/Q26H4JTJ
NMDA receptor subunit 2C (GluN2C)
(Rattus norvegicus (Rat))
BDBM50440079
(CHEMBL2426099)
Show SMILES OC(=O)CCC(=O)N1N=C(CC1c1ccccc1)c1c(-c2ccc(Cl)cc2)c2ccccc2[nH]c1=O |c:8|
Show InChI InChI=1S/C28H22ClN3O4/c29-19-12-10-18(11-13-19)26-20-8-4-5-9-21(20)30-28(36)27(26)22-16-23(17-6-2-1-3-7-17)32(31-22)24(33)14-15-25(34)35/h1-13,23H,14-16H2,(H,30,36)(H,34,35)
n/an/a 1.30E+4n/an/an/an/an/an/a
Emory University
Curated by ChEMBL
Assay Description
Negative allosteric modulation of recombinant rat GluN2C receptor expressed in Xenopus laevis oocytes by two-electrode voltage clamp method
J Med Chem 56: 6434-56 (2013)
Article DOI: 10.1021/jm400652r
BindingDB Entry DOI: 10.7270/Q26H4JTJ