BDBM50440087 CHEMBL2426090
SMILES: CN(C)c1ccc(cc1)C1CC(=NN1C(=O)CCC(O)=O)c1c(-c2ccccc2)c2cc(Cl)ccc2[nH]c1=O
InChI Key: InChIKey=OLORPKYJFYZVRR-UHFFFAOYSA-N
Data: 2 IC50
Activity Spreadsheet -- Enzyme Inhibition Constant Data from BindingDB
Found 2 hits for monomerid = 50440087
Trg + Lig
Ki
nM
ΔG°
kcal/mole
IC50
nM
Kd
nM
EC50/IC50
nM
koff
s-1
kon
M-1s-1
pHTemp
°C
NMDA receptor subunit 2C (GluN2C)
(Rattus norvegicus (Rat))
BDBM50440087
(CHEMBL2426090)
Show SMILES CN(C)c1ccc(cc1)C1CC(=NN1C(=O)CCC(O)=O)c1c(-c2ccccc2)c2cc(Cl)ccc2[nH]c1=O |c:12|
Show InChI InChI=1S/C30H27ClN4O4/c1-34(2)21-11-8-18(9-12-21)25-17-24(33-35(25)26(36)14-15-27(37)38)29-28(19-6-4-3-5-7-19)22-16-20(31)10-13-23(22)32-30(29)39/h3-13,16,25H,14-15,17H2,1-2H3,(H,32,39)(H,37,38)
n/an/a 3.90E+4n/an/an/an/an/an/a
Emory University
Curated by ChEMBL
Assay Description
Negative allosteric modulation of recombinant rat GluN2C receptor expressed in Xenopus laevis oocytes by two-electrode voltage clamp method
J Med Chem 56: 6434-56 (2013)
Article DOI: 10.1021/jm400652r
BindingDB Entry DOI: 10.7270/Q26H4JTJ
Glutamate receptor ionotropic, NMDA 2D
(Rattus norvegicus (Rat))
BDBM50440087
(CHEMBL2426090)
Show SMILES CN(C)c1ccc(cc1)C1CC(=NN1C(=O)CCC(O)=O)c1c(-c2ccccc2)c2cc(Cl)ccc2[nH]c1=O |c:12|
Show InChI InChI=1S/C30H27ClN4O4/c1-34(2)21-11-8-18(9-12-21)25-17-24(33-35(25)26(36)14-15-27(37)38)29-28(19-6-4-3-5-7-19)22-16-20(31)10-13-23(22)32-30(29)39/h3-13,16,25H,14-15,17H2,1-2H3,(H,32,39)(H,37,38)
n/an/a 1.90E+4n/an/an/an/an/an/a
Emory University
Curated by ChEMBL
Assay Description
Negative allosteric modulation of recombinant rat GluN2D receptor expressed in Xenopus laevis oocytes by two-electrode voltage clamp method
J Med Chem 56: 6434-56 (2013)
Article DOI: 10.1021/jm400652r
BindingDB Entry DOI: 10.7270/Q26H4JTJ