BDBM50440099 CHEMBL2426121
SMILES: CCS(=O)(=O)NCC(C)[C@@H](c1ccccc1)c1ccc2n(ncc2c1)-c1ccc(F)cc1
InChI Key: InChIKey=JGVQGSRFINOHGY-LYIYLXCWSA-N
Data: 1 KI  3 EC50
Activity Spreadsheet -- Enzyme Inhibition Constant Data from BindingDB
Found 4 hits for monomerid = 50440099
Trg + Lig
Ki
nM
ΔG°
kcal/mole
IC50
nM
Kd
nM
EC50/IC50
nM
koff
s-1
kon
M-1s-1
pHTemp
°C
Glucocorticoid receptor
(Homo sapiens (Human))
BDBM50440099
(CHEMBL2426121)
Show SMILES CCS(=O)(=O)NCC(C)[C@@H](c1ccccc1)c1ccc2n(ncc2c1)-c1ccc(F)cc1 |r|
Show InChI InChI=1S/C25H26FN3O2S/c1-3-32(30,31)28-16-18(2)25(19-7-5-4-6-8-19)20-9-14-24-21(15-20)17-27-29(24)23-12-10-22(26)11-13-23/h4-15,17-18,25,28H,3,16H2,1-2H3/t18?,25-/m0/s1
0.870n/an/an/an/an/an/an/an/a
Bristol-Myers Squibb Company
Curated by ChEMBL
Assay Description
Binding affinity to glucocorticoid receptor (unknown origin) by fluorescence assay
Bioorg Med Chem Lett 23: 5448-51 (2013)
Article DOI: 10.1016/j.bmcl.2013.06.085
BindingDB Entry DOI: 10.7270/Q22R3T2S
Glucocorticoid receptor
(Homo sapiens (Human))
BDBM50440099
(CHEMBL2426121)
Show SMILES CCS(=O)(=O)NCC(C)[C@@H](c1ccccc1)c1ccc2n(ncc2c1)-c1ccc(F)cc1 |r|
Show InChI InChI=1S/C25H26FN3O2S/c1-3-32(30,31)28-16-18(2)25(19-7-5-4-6-8-19)20-9-14-24-21(15-20)17-27-29(24)23-12-10-22(26)11-13-23/h4-15,17-18,25,28H,3,16H2,1-2H3/t18?,25-/m0/s1
n/an/an/an/a 4.30n/an/an/an/a
Bristol-Myers Squibb Company
Curated by ChEMBL
Assay Description
Transrepression activity at glucocorticoid receptor in human A549 cells assessed as inhibition of PMA-stimulated AP1 response element by luciferase r...
Bioorg Med Chem Lett 23: 5448-51 (2013)
Article DOI: 10.1016/j.bmcl.2013.06.085
BindingDB Entry DOI: 10.7270/Q22R3T2S
Glucocorticoid receptor
(Homo sapiens (Human))
BDBM50440099
(CHEMBL2426121)
Show SMILES CCS(=O)(=O)NCC(C)[C@@H](c1ccccc1)c1ccc2n(ncc2c1)-c1ccc(F)cc1 |r|
Show InChI InChI=1S/C25H26FN3O2S/c1-3-32(30,31)28-16-18(2)25(19-7-5-4-6-8-19)20-9-14-24-21(15-20)17-27-29(24)23-12-10-22(26)11-13-23/h4-15,17-18,25,28H,3,16H2,1-2H3/t18?,25-/m0/s1
n/an/an/an/a 13n/an/an/an/a
Bristol-Myers Squibb Company
Curated by ChEMBL
Assay Description
Transactivation activity at glucocorticoid receptor ligand binding domain (unknown origin) expressed in human Hela cells co-expressing GAL4 DNA bindi...
Bioorg Med Chem Lett 23: 5448-51 (2013)
Article DOI: 10.1016/j.bmcl.2013.06.085
BindingDB Entry DOI: 10.7270/Q22R3T2S
Glucocorticoid receptor
(Homo sapiens (Human))
BDBM50440099
(CHEMBL2426121)
Show SMILES CCS(=O)(=O)NCC(C)[C@@H](c1ccccc1)c1ccc2n(ncc2c1)-c1ccc(F)cc1 |r|
Show InChI InChI=1S/C25H26FN3O2S/c1-3-32(30,31)28-16-18(2)25(19-7-5-4-6-8-19)20-9-14-24-21(15-20)17-27-29(24)23-12-10-22(26)11-13-23/h4-15,17-18,25,28H,3,16H2,1-2H3/t18?,25-/m0/s1
n/an/an/an/a 1.80n/an/an/an/a
Bristol-Myers Squibb Company
Curated by ChEMBL
Assay Description
Transrepression activity at glucocorticoid receptor in human A549 cells assessed as inhibition of IL1beta-stimulated NFkappaB-dependent E-selectin tr...
Bioorg Med Chem Lett 23: 5448-51 (2013)
Article DOI: 10.1016/j.bmcl.2013.06.085
BindingDB Entry DOI: 10.7270/Q22R3T2S