BDBM50440158 CHEMBL2426595
SMILES: Cc1ccc(cc1OCCF)-c1nc(CSc2nc(N)nc(N)n2)cs1
InChI Key: InChIKey=FGBZARCXSQNTGQ-UHFFFAOYSA-N
Data: 2 IC50
Activity Spreadsheet -- Enzyme Inhibition Constant Data from BindingDB
Found 2 hits for monomerid = 50440158
Trg + Lig
Ki
nM
ΔG°
kcal/mole
IC50
nM
Kd
nM
EC50/IC50
nM
koff
s-1
kon
M-1s-1
pHTemp
°C
Deoxycytidine kinase
(Homo sapiens (Human))
BDBM50440158
(CHEMBL2426595)
Show SMILES Cc1ccc(cc1OCCF)-c1nc(CSc2nc(N)nc(N)n2)cs1
Show InChI InChI=1S/C16H17FN6OS2/c1-9-2-3-10(6-12(9)24-5-4-17)13-20-11(7-25-13)8-26-16-22-14(18)21-15(19)23-16/h2-3,6-7H,4-5,8H2,1H3,(H4,18,19,21,22,23)
Reactome pathway
n/an/a 1.92E+3n/an/an/an/an/an/a
California NanoSystems Institute
Curated by ChEMBL
Assay Description
Inhibition of dCK in human CCRF-CEM cells assessed as inhibition of tritiated deoxycytidine [3H]-dC uptake
J Med Chem 56: 6696-708 (2013)
Article DOI: 10.1021/jm400457y
BindingDB Entry DOI: 10.7270/Q2JS9RWP
Deoxycytidine kinase
(Mus musculus)
BDBM50440158
(CHEMBL2426595)
Show SMILES Cc1ccc(cc1OCCF)-c1nc(CSc2nc(N)nc(N)n2)cs1
Show InChI InChI=1S/C16H17FN6OS2/c1-9-2-3-10(6-12(9)24-5-4-17)13-20-11(7-25-13)8-26-16-22-14(18)21-15(19)23-16/h2-3,6-7H,4-5,8H2,1H3,(H4,18,19,21,22,23)
Reactome pathway
n/an/a 3.20E+3n/an/an/an/an/an/a
California NanoSystems Institute
Curated by ChEMBL
Assay Description
Inhibition of dCK in mouse L1210 cells assessed as inhibition of tritiated deoxycytidine [3H]-dC uptake
J Med Chem 56: 6696-708 (2013)
Article DOI: 10.1021/jm400457y
BindingDB Entry DOI: 10.7270/Q2JS9RWP