BDBM50440173 CHEMBL2426573
SMILES: CCCc1sc(nc1CSc1nc(N)cc(N)n1)-c1ccc(OC)c(OCC(C)(C)O)c1
InChI Key: InChIKey=PWASXBOUTAWHOZ-UHFFFAOYSA-N
Data: 2 KI  3 IC50
PDB links: 1 PDB ID matches this monomer.
Activity Spreadsheet -- Enzyme Inhibition Constant Data from BindingDB
Found 5 hits for monomerid = 50440173
Trg + Lig
Ki
nM
ΔG°
kcal/mole
IC50
nM
Kd
nM
EC50/IC50
nM
koff
s-1
kon
M-1s-1
pHTemp
°C
Deoxycytidine kinase
(Homo sapiens (Human))
BDBM50440173
(CHEMBL2426573)
Show SMILES CCCc1sc(nc1CSc1nc(N)cc(N)n1)-c1ccc(OC)c(OCC(C)(C)O)c1
Show InChI InChI=1S/C22H29N5O3S2/c1-5-6-17-14(11-31-21-26-18(23)10-19(24)27-21)25-20(32-17)13-7-8-15(29-4)16(9-13)30-12-22(2,3)28/h7-10,28H,5-6,11-12H2,1-4H3,(H4,23,24,26,27)
Reactome pathway
0.800n/an/an/an/an/an/an/an/a
California NanoSystems Institute
Curated by ChEMBL
Assay Description
Inhibition of dCK (unknown origin) by steady-state kinetic assay
J Med Chem 56: 6696-708 (2013)
Article DOI: 10.1021/jm400457y
BindingDB Entry DOI: 10.7270/Q2JS9RWP
3D
3D Structure (crystal)
Deoxycytidine kinase
(Homo sapiens (Human))
BDBM50440173
(CHEMBL2426573)
Show SMILES CCCc1sc(nc1CSc1nc(N)cc(N)n1)-c1ccc(OC)c(OCC(C)(C)O)c1
Show InChI InChI=1S/C22H29N5O3S2/c1-5-6-17-14(11-31-21-26-18(23)10-19(24)27-21)25-20(32-17)13-7-8-15(29-4)16(9-13)30-12-22(2,3)28/h7-10,28H,5-6,11-12H2,1-4H3,(H4,23,24,26,27)
Reactome pathway
0.800n/an/an/an/an/an/an/an/a
University of Illinois at Chicago
Curated by ChEMBL
Assay Description
Apparent inhibition of human dCK by steady-state kinetic assay
J Med Chem 57: 9480-94 (2014)
Article DOI: 10.1021/jm501124j
BindingDB Entry DOI: 10.7270/Q29025DM
3D
3D Structure (crystal)
Deoxycytidine kinase
(Homo sapiens (Human))
BDBM50440173
(CHEMBL2426573)
Show SMILES CCCc1sc(nc1CSc1nc(N)cc(N)n1)-c1ccc(OC)c(OCC(C)(C)O)c1
Show InChI InChI=1S/C22H29N5O3S2/c1-5-6-17-14(11-31-21-26-18(23)10-19(24)27-21)25-20(32-17)13-7-8-15(29-4)16(9-13)30-12-22(2,3)28/h7-10,28H,5-6,11-12H2,1-4H3,(H4,23,24,26,27)
Reactome pathway
n/an/a 1.40n/an/an/an/an/an/a
California NanoSystems Institute
Curated by ChEMBL
Assay Description
Inhibition of dCK in human CCRF-CEM cells assessed as inhibition of tritiated deoxycytidine [3H]-dC uptake
J Med Chem 56: 6696-708 (2013)
Article DOI: 10.1021/jm400457y
BindingDB Entry DOI: 10.7270/Q2JS9RWP
3D
3D Structure (crystal)
Deoxycytidine kinase
(Homo sapiens (Human))
BDBM50440173
(CHEMBL2426573)
Show SMILES CCCc1sc(nc1CSc1nc(N)cc(N)n1)-c1ccc(OC)c(OCC(C)(C)O)c1
Show InChI InChI=1S/C22H29N5O3S2/c1-5-6-17-14(11-31-21-26-18(23)10-19(24)27-21)25-20(32-17)13-7-8-15(29-4)16(9-13)30-12-22(2,3)28/h7-10,28H,5-6,11-12H2,1-4H3,(H4,23,24,26,27)
Reactome pathway
n/an/a 1.40n/an/an/an/an/an/a
University of Illinois at Chicago
Curated by ChEMBL
Assay Description
Inhibition of dCK in human CCRF-CEM cells assessed as inhibition of [3H]-dC uptake by scintillation counting analysis
J Med Chem 57: 9480-94 (2014)
Article DOI: 10.1021/jm501124j
BindingDB Entry DOI: 10.7270/Q29025DM
3D
3D Structure (crystal)
Deoxycytidine kinase
(Homo sapiens (Human))
BDBM50440173
(CHEMBL2426573)
Show SMILES CCCc1sc(nc1CSc1nc(N)cc(N)n1)-c1ccc(OC)c(OCC(C)(C)O)c1
Show InChI InChI=1S/C22H29N5O3S2/c1-5-6-17-14(11-31-21-26-18(23)10-19(24)27-21)25-20(32-17)13-7-8-15(29-4)16(9-13)30-12-22(2,3)28/h7-10,28H,5-6,11-12H2,1-4H3,(H4,23,24,26,27)
Reactome pathway
n/an/a 15n/an/an/an/an/an/a
University of Illinois at Chicago
Curated by ChEMBL
Assay Description
Apparent inhibition of human dCK assessed as phosphorylation activity by spectroscopic NADH-dependent enzyme-coupled assay
J Med Chem 57: 9480-94 (2014)
Article DOI: 10.1021/jm501124j
BindingDB Entry DOI: 10.7270/Q29025DM
3D
3D Structure (crystal)