BDBM50440182 CHEMBL2426564
SMILES: CCCc1sc(nc1CSc1nc(N)cc(N)n1)-c1cc(F)cc(OCCO)c1
InChI Key: InChIKey=ZTEMIKYCJWFAOB-UHFFFAOYSA-N
Data: 1 IC50
Activity Spreadsheet -- Enzyme Inhibition Constant Data from BindingDB
Found 1 hit for monomerid = 50440182
Trg + Lig
Ki
nM
ΔG°
kcal/mole
IC50
nM
Kd
nM
EC50/IC50
nM
koff
s-1
kon
M-1s-1
pHTemp
°C
Deoxycytidine kinase
(Homo sapiens (Human))
BDBM50440182
(CHEMBL2426564)
Show SMILES CCCc1sc(nc1CSc1nc(N)cc(N)n1)-c1cc(F)cc(OCCO)c1
Show InChI InChI=1S/C19H22FN5O2S2/c1-2-3-15-14(10-28-19-24-16(21)9-17(22)25-19)23-18(29-15)11-6-12(20)8-13(7-11)27-5-4-26/h6-9,26H,2-5,10H2,1H3,(H4,21,22,24,25)
Reactome pathway
n/an/a 2.80n/an/an/an/an/an/a
California NanoSystems Institute
Curated by ChEMBL
Assay Description
Inhibition of dCK in human CCRF-CEM cells assessed as inhibition of tritiated deoxycytidine [3H]-dC uptake
J Med Chem 56: 6696-708 (2013)
Article DOI: 10.1021/jm400457y
BindingDB Entry DOI: 10.7270/Q2JS9RWP