BDBM50440242 CHEMBL2426663
SMILES: CC(C)([C@H](c1ccccc1)c1ccc2n(ncc2c1)-c1ccc(F)cc1)C(=O)Nc1nncs1
InChI Key: InChIKey=XFFATDFCPKLQRT-HSZRJFAPSA-N
Data: 4 KI  3 EC50
Activity Spreadsheet -- Enzyme Inhibition Constant Data from BindingDB
Found 7 hits for monomerid = 50440242
Trg + Lig
Ki
nM
ΔG°
kcal/mole
IC50
nM
Kd
nM
EC50/IC50
nM
koff
s-1
kon
M-1s-1
pHTemp
°C
Glucocorticoid receptor
(Homo sapiens (Human))
BDBM50440242
(CHEMBL2426663)
Show SMILES CC(C)([C@H](c1ccccc1)c1ccc2n(ncc2c1)-c1ccc(F)cc1)C(=O)Nc1nncs1 |r|
Show InChI InChI=1S/C26H22FN5OS/c1-26(2,24(33)30-25-31-28-16-34-25)23(17-6-4-3-5-7-17)18-8-13-22-19(14-18)15-29-32(22)21-11-9-20(27)10-12-21/h3-16,23H,1-2H3,(H,30,31,33)/t23-/m1/s1
6.70n/an/an/an/an/an/an/an/a
Ironwood Pharmaceuticals
Curated by ChEMBL
Assay Description
Binding affinity to glucocorticoid receptor (unknown origin) by fluorescence polarization assay
Bioorg Med Chem Lett 23: 5442-7 (2013)
Article DOI: 10.1016/j.bmcl.2013.06.089
BindingDB Entry DOI: 10.7270/Q29888FB
Glucocorticoid receptor
(Homo sapiens (Human))
BDBM50440242
(CHEMBL2426663)
Show SMILES CC(C)([C@H](c1ccccc1)c1ccc2n(ncc2c1)-c1ccc(F)cc1)C(=O)Nc1nncs1 |r|
Show InChI InChI=1S/C26H22FN5OS/c1-26(2,24(33)30-25-31-28-16-34-25)23(17-6-4-3-5-7-17)18-8-13-22-19(14-18)15-29-32(22)21-11-9-20(27)10-12-21/h3-16,23H,1-2H3,(H,30,31,33)/t23-/m1/s1
18n/an/an/an/an/an/an/an/a
Ironwood Pharmaceuticals
Curated by ChEMBL
Assay Description
Binding affinity to glucocorticoid receptor (unknown origin) by fluorescence polarization assay
Bioorg Med Chem Lett 23: 5442-7 (2013)
Article DOI: 10.1016/j.bmcl.2013.06.089
BindingDB Entry DOI: 10.7270/Q29888FB
Progesterone receptor
(Homo sapiens (Human))
BDBM50440242
(CHEMBL2426663)
Show SMILES CC(C)([C@H](c1ccccc1)c1ccc2n(ncc2c1)-c1ccc(F)cc1)C(=O)Nc1nncs1 |r|
Show InChI InChI=1S/C26H22FN5OS/c1-26(2,24(33)30-25-31-28-16-34-25)23(17-6-4-3-5-7-17)18-8-13-22-19(14-18)15-29-32(22)21-11-9-20(27)10-12-21/h3-16,23H,1-2H3,(H,30,31,33)/t23-/m1/s1
56n/an/an/an/an/an/an/an/a
Ironwood Pharmaceuticals
Curated by ChEMBL
Assay Description
Binding affinity to progesterone receptor (unknown origin) by fluorescence polarization assay
Bioorg Med Chem Lett 23: 5442-7 (2013)
Article DOI: 10.1016/j.bmcl.2013.06.089
BindingDB Entry DOI: 10.7270/Q29888FB
Androgen Receptor
(Homo sapiens (Human))
BDBM50440242
(CHEMBL2426663)
Show SMILES CC(C)([C@H](c1ccccc1)c1ccc2n(ncc2c1)-c1ccc(F)cc1)C(=O)Nc1nncs1 |r|
Show InChI InChI=1S/C26H22FN5OS/c1-26(2,24(33)30-25-31-28-16-34-25)23(17-6-4-3-5-7-17)18-8-13-22-19(14-18)15-29-32(22)21-11-9-20(27)10-12-21/h3-16,23H,1-2H3,(H,30,31,33)/t23-/m1/s1
NCI pathway
Reactome pathway
>2.50E+4n/an/an/an/an/an/an/an/a
Ironwood Pharmaceuticals
Curated by ChEMBL
Assay Description
Binding affinity to androgen receptor (unknown origin) by fluorescence polarization assay
Bioorg Med Chem Lett 23: 5442-7 (2013)
Article DOI: 10.1016/j.bmcl.2013.06.089
BindingDB Entry DOI: 10.7270/Q29888FB
Mineralocorticoid receptor
(Homo sapiens (Human))
BDBM50440242
(CHEMBL2426663)
Show SMILES CC(C)([C@H](c1ccccc1)c1ccc2n(ncc2c1)-c1ccc(F)cc1)C(=O)Nc1nncs1 |r|
Show InChI InChI=1S/C26H22FN5OS/c1-26(2,24(33)30-25-31-28-16-34-25)23(17-6-4-3-5-7-17)18-8-13-22-19(14-18)15-29-32(22)21-11-9-20(27)10-12-21/h3-16,23H,1-2H3,(H,30,31,33)/t23-/m1/s1
n/an/an/an/a>5.00E+6n/an/an/an/a
Ironwood Pharmaceuticals
Curated by ChEMBL
Assay Description
Agonist activity at mineralocorticoid receptor in human A549 cells
Bioorg Med Chem Lett 23: 5442-7 (2013)
Article DOI: 10.1016/j.bmcl.2013.06.089
BindingDB Entry DOI: 10.7270/Q29888FB
Glucocorticoid receptor
(Homo sapiens (Human))
BDBM50440242
(CHEMBL2426663)
Show SMILES CC(C)([C@H](c1ccccc1)c1ccc2n(ncc2c1)-c1ccc(F)cc1)C(=O)Nc1nncs1 |r|
Show InChI InChI=1S/C26H22FN5OS/c1-26(2,24(33)30-25-31-28-16-34-25)23(17-6-4-3-5-7-17)18-8-13-22-19(14-18)15-29-32(22)21-11-9-20(27)10-12-21/h3-16,23H,1-2H3,(H,30,31,33)/t23-/m1/s1
n/an/an/an/a 23n/an/an/an/a
Ironwood Pharmaceuticals
Curated by ChEMBL
Assay Description
Agonist activity at glucocorticoid receptor in human A549 cells assessed as inhibition of PMA-induced AP-1 activation by luciferase reporter gene ass...
Bioorg Med Chem Lett 23: 5442-7 (2013)
Article DOI: 10.1016/j.bmcl.2013.06.089
BindingDB Entry DOI: 10.7270/Q29888FB
Glucocorticoid receptor
(Homo sapiens (Human))
BDBM50440242
(CHEMBL2426663)
Show SMILES CC(C)([C@H](c1ccccc1)c1ccc2n(ncc2c1)-c1ccc(F)cc1)C(=O)Nc1nncs1 |r|
Show InChI InChI=1S/C26H22FN5OS/c1-26(2,24(33)30-25-31-28-16-34-25)23(17-6-4-3-5-7-17)18-8-13-22-19(14-18)15-29-32(22)21-11-9-20(27)10-12-21/h3-16,23H,1-2H3,(H,30,31,33)/t23-/m1/s1
n/an/an/an/a 92n/an/an/an/a
Ironwood Pharmaceuticals
Curated by ChEMBL
Assay Description
Agonist activity at glucocorticoid receptor in human A549 cells assessed as inhibition of PMA-induced AP-1 activation by luciferase reporter gene ass...
Bioorg Med Chem Lett 23: 5442-7 (2013)
Article DOI: 10.1016/j.bmcl.2013.06.089
BindingDB Entry DOI: 10.7270/Q29888FB