BDBM50440373 CHEMBL2425141
SMILES: CC(=O)Nc1sccc1C(N)=O
InChI Key: InChIKey=GQTVFFSGTYGONS-UHFFFAOYSA-N
Data: 1 Kd
Activity Spreadsheet -- Enzyme Inhibition Constant Data from BindingDB
Found 1 hit for monomerid = 50440373
Trg + Lig
Ki
nM
ΔG°
kcal/mole
IC50
nM
Kd
nM
EC50/IC50
nM
koff
s-1
kon
M-1s-1
pHTemp
°C
Focal adhesion kinase 1
(Homo sapiens (Human))
BDBM50440373
(CHEMBL2425141)
Show SMILES CC(=O)Nc1sccc1C(N)=O
Show InChI InChI=1S/C7H8N2O2S/c1-4(10)9-7-5(6(8)11)2-3-12-7/h2-3H,1H3,(H2,8,11)(H,9,10)
NCI pathway
Reactome pathway
n/an/an/a 2.33E+5n/an/an/an/an/a
Merck KGaA
Curated by ChEMBL
Assay Description
Binding affinity to FAK kinase (unknown origin) by surface plasmon resonance assay
Bioorg Med Chem Lett 23: 5401-9 (2013)
Article DOI: 10.1016/j.bmcl.2013.07.050
BindingDB Entry DOI: 10.7270/Q2891782