null
SMILES: c1ncc(o1)-c1ccncc1
InChI Key: InChIKey=AFQAOCIKCVFASO-UHFFFAOYSA-N
Activity Spreadsheet -- Enzyme Inhibition Constant Data from BindingDB
Found 1 hit for monomerid = 50440377
Trg + Lig
Ki
nM
ΔG°
kcal/mole
IC50
nM
Kd
nM
EC50/IC50
nM
koff
s-1
kon
M-1s-1
pHTemp
°C
Focal adhesion kinase 1
(Homo sapiens (Human))
BDBM50440377
(CHEMBL1643353)
Show SMILES c1ncc(o1)-c1ccncc1
Show InChI InChI=1S/C8H6N2O/c1-3-9-4-2-7(1)8-5-10-6-11-8/h1-6H
NCI pathway
Reactome pathway
n/an/an/a 1.35E+6n/an/an/an/an/a
Merck KGaA
Curated by ChEMBL
Assay Description
Binding affinity to FAK kinase (unknown origin) by surface plasmon resonance assay
Bioorg Med Chem Lett 23: 5401-9 (2013)
Article DOI: 10.1016/j.bmcl.2013.07.050
BindingDB Entry DOI: 10.7270/Q2891782