null
SMILES: Brc1cncc(c1)-c1nnn[nH]1
InChI Key: InChIKey=XJGDASCALCDOQH-UHFFFAOYSA-N
Activity Spreadsheet -- Enzyme Inhibition Constant Data from BindingDB
Found 1 hit for monomerid = 50440378
Trg + Lig
Ki
nM
ΔG°
kcal/mole
IC50
nM
Kd
nM
EC50/IC50
nM
koff
s-1
kon
M-1s-1
pHTemp
°C
Focal adhesion kinase 1
(Homo sapiens (Human))
BDBM50440378
(CHEMBL2425111)
Show SMILES Brc1cncc(c1)-c1nnn[nH]1
Show InChI InChI=1S/C6H4BrN5/c7-5-1-4(2-8-3-5)6-9-11-12-10-6/h1-3H,(H,9,10,11,12)
NCI pathway
Reactome pathway
n/an/an/a 9.50E+4n/an/an/an/an/a
Merck KGaA
Curated by ChEMBL
Assay Description
Binding affinity to FAK kinase (unknown origin) by surface plasmon resonance assay
Bioorg Med Chem Lett 23: 5401-9 (2013)
Article DOI: 10.1016/j.bmcl.2013.07.050
BindingDB Entry DOI: 10.7270/Q2891782