null
SMILES: CC(=O)Nc1ccc(Cl)cn1
InChI Key: InChIKey=MCCVKQDZALWIQD-UHFFFAOYSA-N
Activity Spreadsheet -- Enzyme Inhibition Constant Data from BindingDB
Found 1 hit for monomerid = 50440380
Trg + Lig
Ki
nM
ΔG°
kcal/mole
IC50
nM
Kd
nM
EC50/IC50
nM
koff
s-1
kon
M-1s-1
pHTemp
°C
Focal adhesion kinase 1
(Homo sapiens (Human))
BDBM50440380
(CHEMBL2425110)
Show SMILES CC(=O)Nc1ccc(Cl)cn1
Show InChI InChI=1S/C7H7ClN2O/c1-5(11)10-7-3-2-6(8)4-9-7/h2-4H,1H3,(H,9,10,11)
NCI pathway
Reactome pathway
n/an/an/a 7.19E+5n/an/an/an/an/a
Merck KGaA
Curated by ChEMBL
Assay Description
Binding affinity to FAK kinase (unknown origin) by surface plasmon resonance assay
Bioorg Med Chem Lett 23: 5401-9 (2013)
Article DOI: 10.1016/j.bmcl.2013.07.050
BindingDB Entry DOI: 10.7270/Q2891782