BDBM50440514 CHEMBL2426190
SMILES: Clc1ccc(NC(=O)Nc2nnc(s2)-c2ccncc2)cc1C#N
InChI Key: InChIKey=VNTLJDTUZPBYMW-UHFFFAOYSA-N
Data: 2 IC50
Activity Spreadsheet -- Enzyme Inhibition Constant Data from BindingDB
Found 2 hits for monomerid = 50440514
Trg + Lig
Ki
nM
ΔG°
kcal/mole
IC50
nM
Kd
nM
EC50/IC50
nM
koff
s-1
kon
M-1s-1
pHTemp
°C
Werner syndrome ATP-dependent helicase
(Homo sapiens (Human))
BDBM50440514
(CHEMBL2426190)
Show SMILES Clc1ccc(NC(=O)Nc2nnc(s2)-c2ccncc2)cc1C#N
Show InChI InChI=1S/C15H9ClN6OS/c16-12-2-1-11(7-10(12)8-17)19-14(23)20-15-22-21-13(24-15)9-3-5-18-6-4-9/h1-7H,(H2,19,20,22,23)
n/an/a 1.60E+3n/an/an/an/an/an/a
National Center for Advancing Translational Sciences
Curated by ChEMBL
Assay Description
Inhibition of WRN (unknown origin) by gel-based DNA unwinding assay
Bioorg Med Chem Lett 23: 5660-6 (2013)
Checked by Author
Article DOI: 10.1016/j.bmcl.2013.08.025
BindingDB Entry DOI: 10.7270/Q2KK9D78
Bloom syndrome protein
(Homo sapiens (Human))
BDBM50440514
(CHEMBL2426190)
Show SMILES Clc1ccc(NC(=O)Nc2nnc(s2)-c2ccncc2)cc1C#N
Show InChI InChI=1S/C15H9ClN6OS/c16-12-2-1-11(7-10(12)8-17)19-14(23)20-15-22-21-13(24-15)9-3-5-18-6-4-9/h1-7H,(H2,19,20,22,23)
Reactome pathway
n/an/a 100n/an/an/an/an/an/a
National Center for Advancing Translational Sciences
Curated by ChEMBL
Assay Description
Inhibition of BLM (unknown origin) by gel-based DNA unwinding assay
Bioorg Med Chem Lett 23: 5660-6 (2013)
Checked by Author
Article DOI: 10.1016/j.bmcl.2013.08.025
BindingDB Entry DOI: 10.7270/Q2KK9D78