BDBM50440893 CHEMBL2431822
SMILES: C[C@H](c1nnc2ccc(nn12)-c1ccc(F)c(F)c1)c1ccc2ncccc2c1
InChI Key: InChIKey=SQYNPZYBHGTSOY-ZDUSSCGKSA-N
Data: 1 KI  1 IC50
Activity Spreadsheet -- Enzyme Inhibition Constant Data from BindingDB
Found 2 hits for monomerid = 50440893
Trg + Lig
Ki
nM
ΔG°
kcal/mole
IC50
nM
Kd
nM
EC50/IC50
nM
koff
s-1
kon
M-1s-1
pHTemp
°C
Hepatocyte growth factor receptor
(Homo sapiens (Human))
BDBM50440893
(CHEMBL2431822)
Show SMILES C[C@H](c1nnc2ccc(nn12)-c1ccc(F)c(F)c1)c1ccc2ncccc2c1 |r|
Show InChI InChI=1S/C22H15F2N5/c1-13(14-5-7-19-15(11-14)3-2-10-25-19)22-27-26-21-9-8-20(28-29(21)22)16-4-6-17(23)18(24)12-16/h2-13H,1H3/t13-/m0/s1
4n/an/an/an/an/an/an/an/a
Pfizer Inc.
Curated by ChEMBL
Assay Description
Inhibition of N-terminal His-6-tagged human recombinant c-Met (974 to 1390) using Ac-ARDMYDKEYYSVHNK as substrate by spectrophotometric assay
J Med Chem 56: 6651-65 (2013)
Article DOI: 10.1021/jm400926x
BindingDB Entry DOI: 10.7270/Q2HM59WR
Hepatocyte growth factor receptor
(Homo sapiens (Human))
BDBM50440893
(CHEMBL2431822)
Show SMILES C[C@H](c1nnc2ccc(nn12)-c1ccc(F)c(F)c1)c1ccc2ncccc2c1 |r|
Show InChI InChI=1S/C22H15F2N5/c1-13(14-5-7-19-15(11-14)3-2-10-25-19)22-27-26-21-9-8-20(28-29(21)22)16-4-6-17(23)18(24)12-16/h2-13H,1H3/t13-/m0/s1
n/an/a 12n/an/an/an/an/an/a
Pfizer Inc.
Curated by ChEMBL
Assay Description
Inhibition of c-Met autophosphorylation in human A549 cells after 1 hr by ELISA
J Med Chem 56: 6651-65 (2013)
Article DOI: 10.1021/jm400926x
BindingDB Entry DOI: 10.7270/Q2HM59WR