BDBM50440894 CHEMBL2431823
SMILES: COc1ccc(cc1F)-c1ccc2nnc([C@@H](C)c3ccc4ncccc4c3)n2n1
InChI Key: InChIKey=NATHIBVZOPQYLV-AWEZNQCLSA-N
Data: 1 KI  1 IC50
Activity Spreadsheet -- Enzyme Inhibition Constant Data from BindingDB
Found 2 hits for monomerid = 50440894
Trg + Lig
Ki
nM
ΔG°
kcal/mole
IC50
nM
Kd
nM
EC50/IC50
nM
koff
s-1
kon
M-1s-1
pHTemp
°C
Hepatocyte growth factor receptor
(Homo sapiens (Human))
BDBM50440894
(CHEMBL2431823)
Show SMILES COc1ccc(cc1F)-c1ccc2nnc([C@@H](C)c3ccc4ncccc4c3)n2n1 |r|
Show InChI InChI=1S/C23H18FN5O/c1-14(15-5-7-19-16(12-15)4-3-11-25-19)23-27-26-22-10-8-20(28-29(22)23)17-6-9-21(30-2)18(24)13-17/h3-14H,1-2H3/t14-/m0/s1
4n/an/an/an/an/an/an/an/a
Pfizer Inc.
Curated by ChEMBL
Assay Description
Inhibition of N-terminal His-6-tagged human recombinant c-Met (974 to 1390) using Ac-ARDMYDKEYYSVHNK as substrate by spectrophotometric assay
J Med Chem 56: 6651-65 (2013)
Article DOI: 10.1021/jm400926x
BindingDB Entry DOI: 10.7270/Q2HM59WR
Hepatocyte growth factor receptor
(Homo sapiens (Human))
BDBM50440894
(CHEMBL2431823)
Show SMILES COc1ccc(cc1F)-c1ccc2nnc([C@@H](C)c3ccc4ncccc4c3)n2n1 |r|
Show InChI InChI=1S/C23H18FN5O/c1-14(15-5-7-19-16(12-15)4-3-11-25-19)23-27-26-22-10-8-20(28-29(22)23)17-6-9-21(30-2)18(24)13-17/h3-14H,1-2H3/t14-/m0/s1
n/an/a 8n/an/an/an/an/an/a
Pfizer Inc.
Curated by ChEMBL
Assay Description
Inhibition of c-Met autophosphorylation in human A549 cells after 1 hr by ELISA
J Med Chem 56: 6651-65 (2013)
Article DOI: 10.1021/jm400926x
BindingDB Entry DOI: 10.7270/Q2HM59WR