BDBM50440905 CHEMBL2431835
SMILES: C[C@@H](c1ccc2ncccc2c1)n1nnc2ncc(nc12)-c1cnn(CCO)c1
InChI Key: InChIKey=NETRMZMGTHLSBM-ZDUSSCGKSA-N
Data: 1 KI  1 IC50
Activity Spreadsheet -- Enzyme Inhibition Constant Data from BindingDB
Found 2 hits for monomerid = 50440905
Trg + Lig
Ki
nM
ΔG°
kcal/mole
IC50
nM
Kd
nM
EC50/IC50
nM
koff
s-1
kon
M-1s-1
pHTemp
°C
Hepatocyte growth factor receptor
(Homo sapiens (Human))
BDBM50440905
(CHEMBL2431835)
Show SMILES C[C@@H](c1ccc2ncccc2c1)n1nnc2ncc(nc12)-c1cnn(CCO)c1 |r|
Show InChI InChI=1S/C20H18N8O/c1-13(14-4-5-17-15(9-14)3-2-6-21-17)28-20-19(25-26-28)22-11-18(24-20)16-10-23-27(12-16)7-8-29/h2-6,9-13,29H,7-8H2,1H3/t13-/m0/s1
2.80n/an/an/an/an/an/an/an/a
Pfizer Inc.
Curated by ChEMBL
Assay Description
Inhibition of N-terminal His-6-tagged human recombinant c-Met (974 to 1390) using Ac-ARDMYDKEYYSVHNK as substrate by spectrophotometric assay
J Med Chem 56: 6651-65 (2013)
Article DOI: 10.1021/jm400926x
BindingDB Entry DOI: 10.7270/Q2HM59WR
Hepatocyte growth factor receptor
(Homo sapiens (Human))
BDBM50440905
(CHEMBL2431835)
Show SMILES C[C@@H](c1ccc2ncccc2c1)n1nnc2ncc(nc12)-c1cnn(CCO)c1 |r|
Show InChI InChI=1S/C20H18N8O/c1-13(14-4-5-17-15(9-14)3-2-6-21-17)28-20-19(25-26-28)22-11-18(24-20)16-10-23-27(12-16)7-8-29/h2-6,9-13,29H,7-8H2,1H3/t13-/m0/s1
n/an/a 0.5n/an/an/an/an/an/a
Pfizer Inc.
Curated by ChEMBL
Assay Description
Inhibition of c-Met autophosphorylation in human A549 cells after 1 hr by ELISA
J Med Chem 56: 6651-65 (2013)
Article DOI: 10.1021/jm400926x
BindingDB Entry DOI: 10.7270/Q2HM59WR