BDBM50440909 CHEMBL2431907
SMILES: CC(C)(C)C(=O)N1Cc2ccc(cc2C1)C(=O)NO
InChI Key: InChIKey=HMJYQUAVTIECII-UHFFFAOYSA-N
Data: 1 IC50
Activity Spreadsheet -- Enzyme Inhibition Constant Data from BindingDB
Found 1 hit for monomerid = 50440909
Trg + Lig
Ki
nM
ΔG°
kcal/mole
IC50
nM
Kd
nM
EC50/IC50
nM
koff
s-1
kon
M-1s-1
pHTemp
°C
Histone deacetylase 3
(Homo sapiens (Human))
BDBM50440909
(CHEMBL2431907)
Show SMILES CC(C)(C)C(=O)N1Cc2ccc(cc2C1)C(=O)NO
Show InChI InChI=1S/C14H18N2O3/c1-14(2,3)13(18)16-7-10-5-4-9(12(17)15-19)6-11(10)8-16/h4-6,19H,7-8H2,1-3H3,(H,15,17)
NCI pathway
Reactome pathway
n/an/a>5.00E+4n/an/an/an/an/an/a
Millennium Pharmaceuticals, Inc.
Curated by ChEMBL
Assay Description
Inhibition of full length C-terminal His6x-tagged recombinant human HDAC3 expressed in baculovirus using Arg-His-Lys-Lys (Ac) as substrate after 1 hr...
J Med Chem 56: 7201-11 (2013)
Article DOI: 10.1021/jm400385r
BindingDB Entry DOI: 10.7270/Q2862HX7