BDBM50441159 CHEMBL2430882
SMILES: COC(=O)C[C@@H]1N=C(c2ccc(Cl)cc2)c2cc(OC)ccc2-n2c(C)nnc12
InChI Key: InChIKey=FCJDMCOJXLHSKW-KRWDZBQOSA-N
Data: 1 IC50
Activity Spreadsheet -- Enzyme Inhibition Constant Data from BindingDB
Found 1 hit for monomerid = 50441159
Trg + Lig
Ki
nM
ΔG°
kcal/mole
IC50
nM
Kd
nM
EC50/IC50
nM
koff
s-1
kon
M-1s-1
pHTemp
°C
Bromodomain-containing protein 4
(Homo sapiens (Human))
BDBM50441159
(CHEMBL2430882)
Show SMILES COC(=O)C[C@@H]1N=C(c2ccc(Cl)cc2)c2cc(OC)ccc2-n2c(C)nnc12 |r,t:6|
Show InChI InChI=1S/C21H19ClN4O3/c1-12-24-25-21-17(11-19(27)29-3)23-20(13-4-6-14(22)7-5-13)16-10-15(28-2)8-9-18(16)26(12)21/h4-10,17H,11H2,1-3H3/t17-/m0/s1
n/an/a 251n/an/an/an/an/an/a
GlaxoSmithKline R&D
Curated by ChEMBL
Assay Description
Binding affinity to His6-tagged BRD4 (unknown origin) after 60 mins by fluorescence anisotropy binding Assay
J Med Chem 56: 7501-15 (2013)
Article DOI: 10.1021/jm401088k
BindingDB Entry DOI: 10.7270/Q2SX6FN7