BDBM50441161 CHEMBL2430880
SMILES: CCNC(=O)C[C@@H]1N=C(c2cccc(F)c2)c2cc(OC)ccc2-n2c(C)nnc12
InChI Key: InChIKey=HBXKDELJBGLYFK-SFHVURJKSA-N
Data: 1 IC50
Activity Spreadsheet -- Enzyme Inhibition Constant Data from BindingDB
Found 1 hit for monomerid = 50441161
Trg + Lig
Ki
nM
ΔG°
kcal/mole
IC50
nM
Kd
nM
EC50/IC50
nM
koff
s-1
kon
M-1s-1
pHTemp
°C
Bromodomain-containing protein 4
(Homo sapiens (Human))
BDBM50441161
(CHEMBL2430880)
Show SMILES CCNC(=O)C[C@@H]1N=C(c2cccc(F)c2)c2cc(OC)ccc2-n2c(C)nnc12 |r,t:7|
Show InChI InChI=1S/C22H22FN5O2/c1-4-24-20(29)12-18-22-27-26-13(2)28(22)19-9-8-16(30-3)11-17(19)21(25-18)14-6-5-7-15(23)10-14/h5-11,18H,4,12H2,1-3H3,(H,24,29)/t18-/m0/s1
n/an/a 1.26E+3n/an/an/an/an/an/a
GlaxoSmithKline R&D
Curated by ChEMBL
Assay Description
Binding affinity to His6-tagged BRD4 (unknown origin) after 60 mins by fluorescence anisotropy binding Assay
J Med Chem 56: 7501-15 (2013)
Article DOI: 10.1021/jm401088k
BindingDB Entry DOI: 10.7270/Q2SX6FN7