BDBM50441363 CHEMBL2332280
SMILES: [#6](\[#6]=[#6](\c1ccccc1)-c1ccccc1)-[#7]-1-[#6]-[#6]-[#6]-[#6]-[#6]-1
InChI Key: InChIKey=MOCURCBRVYTAME-UHFFFAOYSA-N
Data: 2 KI  5 IC50  1 EC50
Activity Spreadsheet -- Enzyme Inhibition Constant Data from BindingDB
Found 8 hits for monomerid = 50441363
Trg + Lig
Ki
nM
ΔG°
kcal/mole
IC50
nM
Kd
nM
EC50/IC50
nM
koff
s-1
kon
M-1s-1
pHTemp
°C
Neuronal acetylcholine receptor Alpha-4/Beta-2
(Homo sapiens (Human))
BDBM50441363
(CHEMBL2332280)
Show SMILES [#6](\[#6]=[#6](\c1ccccc1)-c1ccccc1)-[#7]-1-[#6]-[#6]-[#6]-[#6]-[#6]-1
Show InChI InChI=1S/C20H23N/c1-4-10-18(11-5-1)20(19-12-6-2-7-13-19)14-17-21-15-8-3-9-16-21/h1-2,4-7,10-14H,3,8-9,15-17H2
NCI pathway
Reactome pathway
160n/an/an/an/an/an/an/an/a
Targacept, Inc
Curated by ChEMBL
Assay Description
Displacement of [3H]nicotine from human alpha4beta2 nAChR expressed in human SH-EP1 cell membranes after 2 hrs by liquid scintillation counting analy...
Bioorg Med Chem Lett 23: 4842-7 (2013)
Article DOI: 10.1016/j.bmcl.2013.06.094
BindingDB Entry DOI: 10.7270/Q2VT1THP
Neuronal acetylcholine receptor; alpha3/beta4
(Homo sapiens (Human))
BDBM50441363
(CHEMBL2332280)
Show SMILES [#6](\[#6]=[#6](\c1ccccc1)-c1ccccc1)-[#7]-1-[#6]-[#6]-[#6]-[#6]-[#6]-1
Show InChI InChI=1S/C20H23N/c1-4-10-18(11-5-1)20(19-12-6-2-7-13-19)14-17-21-15-8-3-9-16-21/h1-2,4-7,10-14H,3,8-9,15-17H2
2.20E+3n/an/an/an/an/an/an/an/a
Targacept, Inc.
Curated by ChEMBL
Assay Description
Displacement of [3H]epibatidine from human alpha3beta4 nAChR expressed in CHO cells after 2 hrs by liquid scintillation counting
Bioorg Med Chem Lett 23: 1450-5 (2013)
Article DOI: 10.1016/j.bmcl.2012.12.054
BindingDB Entry DOI: 10.7270/Q2SQ939P
Neuronal acetylcholine receptor; alpha3/beta4
(Homo sapiens (Human))
BDBM50441363
(CHEMBL2332280)
Show SMILES [#6](\[#6]=[#6](\c1ccccc1)-c1ccccc1)-[#7]-1-[#6]-[#6]-[#6]-[#6]-[#6]-1
Show InChI InChI=1S/C20H23N/c1-4-10-18(11-5-1)20(19-12-6-2-7-13-19)14-17-21-15-8-3-9-16-21/h1-2,4-7,10-14H,3,8-9,15-17H2
n/an/an/an/a>1.00E+4n/an/an/an/a
Targacept, Inc.
Curated by ChEMBL
Assay Description
Agonist activity at human alpha3beta4 nAChR expressed in CHO cells assessed as calcium influx by calcium-4 based FLIPR analysis
Bioorg Med Chem Lett 23: 1450-5 (2013)
Article DOI: 10.1016/j.bmcl.2012.12.054
BindingDB Entry DOI: 10.7270/Q2SQ939P
Neuronal acetylcholine receptor; alpha3/beta4
(Homo sapiens (Human))
BDBM50441363
(CHEMBL2332280)
Show SMILES [#6](\[#6]=[#6](\c1ccccc1)-c1ccccc1)-[#7]-1-[#6]-[#6]-[#6]-[#6]-[#6]-1
Show InChI InChI=1S/C20H23N/c1-4-10-18(11-5-1)20(19-12-6-2-7-13-19)14-17-21-15-8-3-9-16-21/h1-2,4-7,10-14H,3,8-9,15-17H2
n/an/a 380n/an/an/an/an/an/a
Targacept, Inc.
Curated by ChEMBL
Assay Description
Non-competitive antagonist activity at human alpha3beta4 nAChR expressed in CHO cells assessed as inhibition of nicotine-induced calcium influx incub...
Bioorg Med Chem Lett 23: 1450-5 (2013)
Article DOI: 10.1016/j.bmcl.2012.12.054
BindingDB Entry DOI: 10.7270/Q2SQ939P
Neuronal acetylcholine receptor; alpha3/beta4
(Homo sapiens (Human))
BDBM50441363
(CHEMBL2332280)
Show SMILES [#6](\[#6]=[#6](\c1ccccc1)-c1ccccc1)-[#7]-1-[#6]-[#6]-[#6]-[#6]-[#6]-1
Show InChI InChI=1S/C20H23N/c1-4-10-18(11-5-1)20(19-12-6-2-7-13-19)14-17-21-15-8-3-9-16-21/h1-2,4-7,10-14H,3,8-9,15-17H2
n/an/a 100n/an/an/an/an/an/a
Targacept, Inc.
Curated by ChEMBL
Assay Description
Inhibition of human alpha3beta4 nAChR expressed in CHO cells assessed as inhibition of calcium influx by calcium-4 based FLIPR analysis
Bioorg Med Chem Lett 23: 1450-5 (2013)
Article DOI: 10.1016/j.bmcl.2012.12.054
BindingDB Entry DOI: 10.7270/Q2SQ939P
Muscarinic acetylcholine receptor M1
(RAT)
BDBM50441363
(CHEMBL2332280)
Show SMILES [#6](\[#6]=[#6](\c1ccccc1)-c1ccccc1)-[#7]-1-[#6]-[#6]-[#6]-[#6]-[#6]-1
Show InChI InChI=1S/C20H23N/c1-4-10-18(11-5-1)20(19-12-6-2-7-13-19)14-17-21-15-8-3-9-16-21/h1-2,4-7,10-14H,3,8-9,15-17H2
Reactome pathway
n/an/a 76n/an/an/an/an/an/a
Targacept, Inc.
Curated by ChEMBL
Assay Description
Antagonist activity at rat muscarinic M1 receptor isolated from brain
Bioorg Med Chem Lett 23: 1450-5 (2013)
Article DOI: 10.1016/j.bmcl.2012.12.054
BindingDB Entry DOI: 10.7270/Q2SQ939P
Muscarinic acetylcholine receptor M2
(RAT)
BDBM50441363
(CHEMBL2332280)
Show SMILES [#6](\[#6]=[#6](\c1ccccc1)-c1ccccc1)-[#7]-1-[#6]-[#6]-[#6]-[#6]-[#6]-1
Show InChI InChI=1S/C20H23N/c1-4-10-18(11-5-1)20(19-12-6-2-7-13-19)14-17-21-15-8-3-9-16-21/h1-2,4-7,10-14H,3,8-9,15-17H2
Reactome pathway
n/an/a 372n/an/an/an/an/an/a
Targacept, Inc.
Curated by ChEMBL
Assay Description
Antagonist activity at rat muscarinic M2 receptor isolated from brain
Bioorg Med Chem Lett 23: 1450-5 (2013)
Article DOI: 10.1016/j.bmcl.2012.12.054
BindingDB Entry DOI: 10.7270/Q2SQ939P
Neuronal acetylcholine receptor; alpha3/beta4
(Homo sapiens (Human))
BDBM50441363
(CHEMBL2332280)
Show SMILES [#6](\[#6]=[#6](\c1ccccc1)-c1ccccc1)-[#7]-1-[#6]-[#6]-[#6]-[#6]-[#6]-1
Show InChI InChI=1S/C20H23N/c1-4-10-18(11-5-1)20(19-12-6-2-7-13-19)14-17-21-15-8-3-9-16-21/h1-2,4-7,10-14H,3,8-9,15-17H2
n/an/a 380n/an/an/an/an/an/a
Targacept, Inc.
Curated by ChEMBL
Assay Description
Non-competitive antagonist activity at human alpha3beta4 nAChR expressed in CHO cells assessed as inhibition of nicotine-induced calcium influx incub...
Bioorg Med Chem Lett 23: 1450-5 (2013)
Article DOI: 10.1016/j.bmcl.2012.12.054
BindingDB Entry DOI: 10.7270/Q2SQ939P