BDBM50441448 CHEMBL2436267
SMILES: C(N1CCCC1)c1nc2ccccc2n1Cc1ccccc1
InChI Key: InChIKey=BKFIBMYNIKHYPV-UHFFFAOYSA-N
Data: 2 IC50
Activity Spreadsheet -- Enzyme Inhibition Constant Data from BindingDB
Found 2 hits for monomerid = 50441448
Trg + Lig
Ki
nM
ΔG°
kcal/mole
IC50
nM
Kd
nM
EC50/IC50
nM
koff
s-1
kon
M-1s-1
pHTemp
°C
Heme Oxygenase 1 (HO-1)
(Rattus norvegicus (rat))
BDBM50441448
(CHEMBL2436267)
Show SMILES C(N1CCCC1)c1nc2ccccc2n1Cc1ccccc1
Show InChI InChI=1S/C19H21N3/c1-2-8-16(9-3-1)14-22-18-11-5-4-10-17(18)20-19(22)15-21-12-6-7-13-21/h1-5,8-11H,6-7,12-15H2
Reactome pathway
n/an/a>1.00E+5n/an/an/an/an/an/a
Queen's University
Curated by ChEMBL
Assay Description
Inhibition of HO-1 in Sprague-Dawley rat spleen microsomal fractions assessed as carbon monoxide formation from methemalbumin after 10 mins by gas ch...
Bioorg Med Chem 21: 6788-95 (2013)
Article DOI: 10.1016/j.bmc.2013.07.050
BindingDB Entry DOI: 10.7270/Q27082VV
Heme Oxygenase 2 (HO-2)
(Rattus norvegicus (rat))
BDBM50441448
(CHEMBL2436267)
Show SMILES C(N1CCCC1)c1nc2ccccc2n1Cc1ccccc1
Show InChI InChI=1S/C19H21N3/c1-2-8-16(9-3-1)14-22-18-11-5-4-10-17(18)20-19(22)15-21-12-6-7-13-21/h1-5,8-11H,6-7,12-15H2
Reactome pathway
n/an/a 3.10E+3n/an/an/an/an/an/a
Queen's University
Curated by ChEMBL
Assay Description
Inhibition of HO-2 in Sprague-Dawley rat brain microsomal fractions assessed as carbon monoxide formation from methemalbumin after 10 mins by gas chr...
Bioorg Med Chem 21: 6788-95 (2013)
Article DOI: 10.1016/j.bmc.2013.07.050
BindingDB Entry DOI: 10.7270/Q27082VV