BDBM50441450 CHEMBL2436266
SMILES: Clc1cc(Cl)cc(Cn2c(CN3CCCC3)nc3ccccc23)c1
InChI Key: InChIKey=OBLLRECESBTLCK-UHFFFAOYSA-N
Data: 2 IC50
Activity Spreadsheet -- Enzyme Inhibition Constant Data from BindingDB
Found 2 hits for monomerid = 50441450
Trg + Lig
Ki
nM
ΔG°
kcal/mole
IC50
nM
Kd
nM
EC50/IC50
nM
koff
s-1
kon
M-1s-1
pHTemp
°C
Heme Oxygenase 1 (HO-1)
(Rattus norvegicus (rat))
BDBM50441450
(CHEMBL2436266)
Show SMILES Clc1cc(Cl)cc(Cn2c(CN3CCCC3)nc3ccccc23)c1
Show InChI InChI=1S/C19H19Cl2N3/c20-15-9-14(10-16(21)11-15)12-24-18-6-2-1-5-17(18)22-19(24)13-23-7-3-4-8-23/h1-2,5-6,9-11H,3-4,7-8,12-13H2
Reactome pathway
n/an/a>1.00E+5n/an/an/an/an/an/a
Queen's University
Curated by ChEMBL
Assay Description
Inhibition of HO-1 in Sprague-Dawley rat spleen microsomal fractions assessed as carbon monoxide formation from methemalbumin after 10 mins by gas ch...
Bioorg Med Chem 21: 6788-95 (2013)
Article DOI: 10.1016/j.bmc.2013.07.050
BindingDB Entry DOI: 10.7270/Q27082VV
Heme Oxygenase 2 (HO-2)
(Rattus norvegicus (rat))
BDBM50441450
(CHEMBL2436266)
Show SMILES Clc1cc(Cl)cc(Cn2c(CN3CCCC3)nc3ccccc23)c1
Show InChI InChI=1S/C19H19Cl2N3/c20-15-9-14(10-16(21)11-15)12-24-18-6-2-1-5-17(18)22-19(24)13-23-7-3-4-8-23/h1-2,5-6,9-11H,3-4,7-8,12-13H2
Reactome pathway
n/an/a 2.10E+3n/an/an/an/an/an/a
Queen's University
Curated by ChEMBL
Assay Description
Inhibition of HO-2 in Sprague-Dawley rat brain microsomal fractions assessed as carbon monoxide formation from methemalbumin after 10 mins by gas chr...
Bioorg Med Chem 21: 6788-95 (2013)
Article DOI: 10.1016/j.bmc.2013.07.050
BindingDB Entry DOI: 10.7270/Q27082VV