BDBM50441474 CHEMBL2436563
SMILES: Fc1cccc(F)c1C(=O)N1CCC2(CCN(C2)C(=O)Nc2ccc(cc2)C(F)(F)F)CC1
InChI Key: InChIKey=KBSLYWMFANXFDE-UHFFFAOYSA-N
Data: 3 IC50
Activity Spreadsheet -- Enzyme Inhibition Constant Data from BindingDB
Found 3 hits for monomerid = 50441474
Trg + Lig
Ki
nM
ΔG°
kcal/mole
IC50
nM
Kd
nM
EC50/IC50
nM
koff
s-1
kon
M-1s-1
pHTemp
°C
Soluble epoxide hydrolase (sEH)
(Mus musculus (Mouse))
BDBM50441474
(CHEMBL2436563)
Show SMILES Fc1cccc(F)c1C(=O)N1CCC2(CCN(C2)C(=O)Nc2ccc(cc2)C(F)(F)F)CC1
Show InChI InChI=1S/C23H22F5N3O2/c24-17-2-1-3-18(25)19(17)20(32)30-11-8-22(9-12-30)10-13-31(14-22)21(33)29-16-6-4-15(5-7-16)23(26,27)28/h1-7H,8-14H2,(H,29,33)
n/an/a 228n/an/an/an/an/an/a
Toray Industries Inc.
Curated by ChEMBL
Assay Description
Inhibition of mouse sEH using cyano(6-methoxy-naphthalen-2-yl)methyl trans-[(3-phenyloxiran-2-yl)methyl]carbonate after 20 to 45 mins by fluorescence...
Bioorg Med Chem Lett 23: 5975-9 (2013)
Article DOI: 10.1016/j.bmcl.2013.08.054
BindingDB Entry DOI: 10.7270/Q2TT4SDR
Epoxide hydrolase 2
(Rattus norvegicus)
BDBM50441474
(CHEMBL2436563)
Show SMILES Fc1cccc(F)c1C(=O)N1CCC2(CCN(C2)C(=O)Nc2ccc(cc2)C(F)(F)F)CC1
Show InChI InChI=1S/C23H22F5N3O2/c24-17-2-1-3-18(25)19(17)20(32)30-11-8-22(9-12-30)10-13-31(14-22)21(33)29-16-6-4-15(5-7-16)23(26,27)28/h1-7H,8-14H2,(H,29,33)
n/an/a 6.10n/an/an/an/an/an/a
Toray Industries Inc.
Curated by ChEMBL
Assay Description
Inhibition of rat sEH expressed in Sf9 insect cells using cyano(6-methoxy-naphthalen-2-yl)methyl trans-[(3-phenyloxiran-2-yl)methyl]carbonate after 2...
Bioorg Med Chem Lett 23: 5975-9 (2013)
Article DOI: 10.1016/j.bmcl.2013.08.054
BindingDB Entry DOI: 10.7270/Q2TT4SDR
EBifunctional epoxide hydrolase 2
(Homo sapiens (Human))
BDBM50441474
(CHEMBL2436563)
Show SMILES Fc1cccc(F)c1C(=O)N1CCC2(CCN(C2)C(=O)Nc2ccc(cc2)C(F)(F)F)CC1
Show InChI InChI=1S/C23H22F5N3O2/c24-17-2-1-3-18(25)19(17)20(32)30-11-8-22(9-12-30)10-13-31(14-22)21(33)29-16-6-4-15(5-7-16)23(26,27)28/h1-7H,8-14H2,(H,29,33)
n/an/a 0.300n/an/an/an/an/an/a
Toray Industries Inc.
Curated by ChEMBL
Assay Description
Inhibition of human recombinant sEH using cyano(6-methoxy-naphthalen-2-yl)methyl trans-[(3-phenyloxiran-2-yl)methyl]carbonate after 20 to 45 mins by ...
Bioorg Med Chem Lett 23: 5975-9 (2013)
Article DOI: 10.1016/j.bmcl.2013.08.054
BindingDB Entry DOI: 10.7270/Q2TT4SDR