BDBM50441484 CHEMBL2436587
SMILES: FC(F)(F)Oc1ccc(NC(=O)N2CCC3(C2)CCN(CC3)C(=O)C2CC2(F)F)cc1
InChI Key: InChIKey=AERCRGJRLDFMTN-UHFFFAOYSA-N
Data: 2 IC50
Activity Spreadsheet -- Enzyme Inhibition Constant Data from BindingDB
Found 2 hits for monomerid = 50441484
Trg + Lig
Ki
nM
ΔG°
kcal/mole
IC50
nM
Kd
nM
EC50/IC50
nM
koff
s-1
kon
M-1s-1
pHTemp
°C
EBifunctional epoxide hydrolase 2
(Homo sapiens (Human))
BDBM50441484
(CHEMBL2436587)
Show SMILES FC(F)(F)Oc1ccc(NC(=O)N2CCC3(C2)CCN(CC3)C(=O)C2CC2(F)F)cc1
Show InChI InChI=1S/C20H22F5N3O3/c21-19(22)11-15(19)16(29)27-8-5-18(6-9-27)7-10-28(12-18)17(30)26-13-1-3-14(4-2-13)31-20(23,24)25/h1-4,15H,5-12H2,(H,26,30)
n/an/a 0.5n/an/an/an/an/an/a
Toray Industries Inc.
Curated by ChEMBL
Assay Description
Inhibition of human recombinant sEH using cyano(6-methoxy-naphthalen-2-yl)methyl trans-[(3-phenyloxiran-2-yl)methyl]carbonate after 20 to 45 mins by ...
Bioorg Med Chem Lett 23: 5975-9 (2013)
Article DOI: 10.1016/j.bmcl.2013.08.054
BindingDB Entry DOI: 10.7270/Q2TT4SDR
Epoxide hydrolase 2
(Rattus norvegicus)
BDBM50441484
(CHEMBL2436587)
Show SMILES FC(F)(F)Oc1ccc(NC(=O)N2CCC3(C2)CCN(CC3)C(=O)C2CC2(F)F)cc1
Show InChI InChI=1S/C20H22F5N3O3/c21-19(22)11-15(19)16(29)27-8-5-18(6-9-27)7-10-28(12-18)17(30)26-13-1-3-14(4-2-13)31-20(23,24)25/h1-4,15H,5-12H2,(H,26,30)
n/an/a 16n/an/an/an/an/an/a
Toray Industries Inc.
Curated by ChEMBL
Assay Description
Inhibition of rat sEH expressed in Sf9 insect cells using cyano(6-methoxy-naphthalen-2-yl)methyl trans-[(3-phenyloxiran-2-yl)methyl]carbonate after 2...
Bioorg Med Chem Lett 23: 5975-9 (2013)
Article DOI: 10.1016/j.bmcl.2013.08.054
BindingDB Entry DOI: 10.7270/Q2TT4SDR