BDBM50441647 CHEMBL2437420
SMILES: COCCn1c2ccccc2n(C2CCN(CC2)C(=O)C2CCN(Cc3ccnc(N)c3)CC2)c1=O
InChI Key: InChIKey=FYZINNJJPXURBD-UHFFFAOYSA-N
Data: 1 KI  1 IC50  1 Kd
Activity Spreadsheet -- Enzyme Inhibition Constant Data from BindingDB
Found 3 hits for monomerid = 50441647
Trg + Lig
Ki
nM
ΔG°
kcal/mole
IC50
nM
Kd
nM
EC50/IC50
nM
koff
s-1
kon
M-1s-1
pHTemp
°C
HRH3
(GUINEA PIG)
BDBM50441647
(CHEMBL2437420)
Show SMILES COCCn1c2ccccc2n(C2CCN(CC2)C(=O)C2CCN(Cc3ccnc(N)c3)CC2)c1=O
Show InChI InChI=1S/C27H36N6O3/c1-36-17-16-32-23-4-2-3-5-24(23)33(27(32)35)22-9-14-31(15-10-22)26(34)21-7-12-30(13-8-21)19-20-6-11-29-25(28)18-20/h2-6,11,18,21-22H,7-10,12-17,19H2,1H3,(H2,28,29)
1.5n/an/an/an/an/an/an/an/a
Merck Research Laboratories
Curated by ChEMBL
Assay Description
Displacement of [3H]-N-alpha-methyl histamine from histamine H3 receptor in guinea pig brain homogenates
Bioorg Med Chem Lett 23: 6001-3 (2013)
Article DOI: 10.1016/j.bmcl.2013.08.012
BindingDB Entry DOI: 10.7270/Q2542Q1F
Cytochrome P450 2D6
(Homo sapiens (Human))
BDBM50441647
(CHEMBL2437420)
Show SMILES COCCn1c2ccccc2n(C2CCN(CC2)C(=O)C2CCN(Cc3ccnc(N)c3)CC2)c1=O
Show InChI InChI=1S/C27H36N6O3/c1-36-17-16-32-23-4-2-3-5-24(23)33(27(32)35)22-9-14-31(15-10-22)26(34)21-7-12-30(13-8-21)19-20-6-11-29-25(28)18-20/h2-6,11,18,21-22H,7-10,12-17,19H2,1H3,(H2,28,29)
n/an/a>3.00E+4n/an/an/an/an/an/a
Merck Research Laboratories
Curated by ChEMBL
Assay Description
Inhibition of CYP2D6 in human liver microsomes
Bioorg Med Chem Lett 23: 6001-3 (2013)
Article DOI: 10.1016/j.bmcl.2013.08.012
BindingDB Entry DOI: 10.7270/Q2542Q1F
HRH3
(GUINEA PIG)
BDBM50441647
(CHEMBL2437420)
Show SMILES COCCn1c2ccccc2n(C2CCN(CC2)C(=O)C2CCN(Cc3ccnc(N)c3)CC2)c1=O
Show InChI InChI=1S/C27H36N6O3/c1-36-17-16-32-23-4-2-3-5-24(23)33(27(32)35)22-9-14-31(15-10-22)26(34)21-7-12-30(13-8-21)19-20-6-11-29-25(28)18-20/h2-6,11,18,21-22H,7-10,12-17,19H2,1H3,(H2,28,29)
n/an/an/a 10n/an/an/an/an/a
Merck Research Laboratories
Curated by ChEMBL
Assay Description
Antagonist activity at histamine H3 receptor in electrically stimulated guinea pig ileum
Bioorg Med Chem Lett 23: 6001-3 (2013)
Article DOI: 10.1016/j.bmcl.2013.08.012
BindingDB Entry DOI: 10.7270/Q2542Q1F