BDBM50441693 CHEMBL2435862
SMILES: CC(CCNC(=O)c1c(C)cc(Cl)nc1C)N1CCC(CC1)N1[C@@H](CN(Cc2cnccc2C)C1=O)c1ccccc1
InChI Key: InChIKey=GLPOBUHYQIRJAI-PEFOLFAWSA-N
Data: 3 IC50
Activity Spreadsheet -- Enzyme Inhibition Constant Data from BindingDB
Found 3 hits for monomerid = 50441693
Trg + Lig
Ki
nM
ΔG°
kcal/mole
IC50
nM
Kd
nM
EC50/IC50
nM
koff
s-1
kon
M-1s-1
pHTemp
°C
C-C chemokine receptor type 5
(Homo sapiens (Human))
BDBM50441693
(CHEMBL2435862)
Show SMILES CC(CCNC(=O)c1c(C)cc(Cl)nc1C)N1CCC(CC1)N1[C@@H](CN(Cc2cnccc2C)C1=O)c1ccccc1 |r|
Show InChI InChI=1S/C33H41ClN6O2/c1-22-10-14-35-19-27(22)20-39-21-29(26-8-6-5-7-9-26)40(33(39)42)28-12-16-38(17-13-28)24(3)11-15-36-32(41)31-23(2)18-30(34)37-25(31)4/h5-10,14,18-19,24,28-29H,11-13,15-17,20-21H2,1-4H3,(H,36,41)/t24?,29-/m0/s1
n/an/a 8n/an/an/an/an/an/a
Sanofi
Curated by ChEMBL
Assay Description
Displacement of [125I]-RANTES from CCR5 (unknown origin) expressed in HEK293F cell membranes after 45 mins by microbeta jet liquid scintillation coun...
J Med Chem 56: 8049-65 (2013)
Article DOI: 10.1021/jm401101p
BindingDB Entry DOI: 10.7270/Q2445NX3
C-C chemokine receptor type 5
(Homo sapiens (Human))
BDBM50441693
(CHEMBL2435862)
Show SMILES CC(CCNC(=O)c1c(C)cc(Cl)nc1C)N1CCC(CC1)N1[C@@H](CN(Cc2cnccc2C)C1=O)c1ccccc1 |r|
Show InChI InChI=1S/C33H41ClN6O2/c1-22-10-14-35-19-27(22)20-39-21-29(26-8-6-5-7-9-26)40(33(39)42)28-12-16-38(17-13-28)24(3)11-15-36-32(41)31-23(2)18-30(34)37-25(31)4/h5-10,14,18-19,24,28-29H,11-13,15-17,20-21H2,1-4H3,(H,36,41)/t24?,29-/m0/s1
n/an/a 1.20n/an/an/an/an/an/a
Sanofi
Curated by ChEMBL
Assay Description
Antagonist activity at CCR5 (unknown origin) expressed in HEK293F cell membranes assessed as inhibition of RANTES-induced calcium flux preincubated f...
J Med Chem 56: 8049-65 (2013)
Article DOI: 10.1021/jm401101p
BindingDB Entry DOI: 10.7270/Q2445NX3
C-C chemokine receptor type 5
(Homo sapiens (Human))
BDBM50441693
(CHEMBL2435862)
Show SMILES CC(CCNC(=O)c1c(C)cc(Cl)nc1C)N1CCC(CC1)N1[C@@H](CN(Cc2cnccc2C)C1=O)c1ccccc1 |r|
Show InChI InChI=1S/C33H41ClN6O2/c1-22-10-14-35-19-27(22)20-39-21-29(26-8-6-5-7-9-26)40(33(39)42)28-12-16-38(17-13-28)24(3)11-15-36-32(41)31-23(2)18-30(34)37-25(31)4/h5-10,14,18-19,24,28-29H,11-13,15-17,20-21H2,1-4H3,(H,36,41)/t24?,29-/m0/s1
n/an/a 1.70n/an/an/an/an/an/a
Sanofi
Curated by ChEMBL
Assay Description
Inhibition of CCR5 (unknown origin) expressed in human HeLa cells assessed as inhibition of interaction of CHO cells expressing HIV-1 JRFLenv and HIV...
J Med Chem 56: 8049-65 (2013)
Article DOI: 10.1021/jm401101p
BindingDB Entry DOI: 10.7270/Q2445NX3