BDBM50441725 CHEMBL2435909
SMILES: CC(CCNC(=O)c1c(C)cc(Cl)nc1C)N1CCC(CC1)N1[C@@H](CN(CC2CCOCC2)C1=O)c1ccccc1
InChI Key: InChIKey=UPDSQDKCTCPMPO-WOKNPCPGSA-N
Data: 3 IC50
Activity Spreadsheet -- Enzyme Inhibition Constant Data from BindingDB
Found 3 hits for monomerid = 50441725
Trg + Lig
Ki
nM
ΔG°
kcal/mole
IC50
nM
Kd
nM
EC50/IC50
nM
koff
s-1
kon
M-1s-1
pHTemp
°C
C-C chemokine receptor type 5
(Homo sapiens (Human))
BDBM50441725
(CHEMBL2435909)
Show SMILES CC(CCNC(=O)c1c(C)cc(Cl)nc1C)N1CCC(CC1)N1[C@@H](CN(CC2CCOCC2)C1=O)c1ccccc1 |r|
Show InChI InChI=1S/C32H44ClN5O3/c1-22-19-29(33)35-24(3)30(22)31(39)34-14-9-23(2)36-15-10-27(11-16-36)38-28(26-7-5-4-6-8-26)21-37(32(38)40)20-25-12-17-41-18-13-25/h4-8,19,23,25,27-28H,9-18,20-21H2,1-3H3,(H,34,39)/t23?,28-/m0/s1
n/an/a 1.10n/an/an/an/an/an/a
Sanofi
Curated by ChEMBL
Assay Description
Inhibition of CCR5 (unknown origin) expressed in human HeLa cells assessed as inhibition of interaction of CHO cells expressing HIV-1 JRFLenv and HIV...
J Med Chem 56: 8049-65 (2013)
Article DOI: 10.1021/jm401101p
BindingDB Entry DOI: 10.7270/Q2445NX3
C-C chemokine receptor type 5
(Homo sapiens (Human))
BDBM50441725
(CHEMBL2435909)
Show SMILES CC(CCNC(=O)c1c(C)cc(Cl)nc1C)N1CCC(CC1)N1[C@@H](CN(CC2CCOCC2)C1=O)c1ccccc1 |r|
Show InChI InChI=1S/C32H44ClN5O3/c1-22-19-29(33)35-24(3)30(22)31(39)34-14-9-23(2)36-15-10-27(11-16-36)38-28(26-7-5-4-6-8-26)21-37(32(38)40)20-25-12-17-41-18-13-25/h4-8,19,23,25,27-28H,9-18,20-21H2,1-3H3,(H,34,39)/t23?,28-/m0/s1
n/an/a 15n/an/an/an/an/an/a
Sanofi
Curated by ChEMBL
Assay Description
Displacement of [125I]-RANTES from CCR5 (unknown origin) expressed in HEK293F cell membranes after 45 mins by microbeta jet liquid scintillation coun...
J Med Chem 56: 8049-65 (2013)
Article DOI: 10.1021/jm401101p
BindingDB Entry DOI: 10.7270/Q2445NX3
C-C chemokine receptor type 5
(Homo sapiens (Human))
BDBM50441725
(CHEMBL2435909)
Show SMILES CC(CCNC(=O)c1c(C)cc(Cl)nc1C)N1CCC(CC1)N1[C@@H](CN(CC2CCOCC2)C1=O)c1ccccc1 |r|
Show InChI InChI=1S/C32H44ClN5O3/c1-22-19-29(33)35-24(3)30(22)31(39)34-14-9-23(2)36-15-10-27(11-16-36)38-28(26-7-5-4-6-8-26)21-37(32(38)40)20-25-12-17-41-18-13-25/h4-8,19,23,25,27-28H,9-18,20-21H2,1-3H3,(H,34,39)/t23?,28-/m0/s1
n/an/a 0.800n/an/an/an/an/an/a
Sanofi
Curated by ChEMBL
Assay Description
Antagonist activity at CCR5 (unknown origin) expressed in HEK293F cell membranes assessed as inhibition of RANTES-induced calcium flux preincubated f...
J Med Chem 56: 8049-65 (2013)
Article DOI: 10.1021/jm401101p
BindingDB Entry DOI: 10.7270/Q2445NX3