null
SMILES: Cc1nc(Sc2ccc(cc2)C(O)=O)ccc1CN1CCC(CC1)N1[C@@H](CN(C2CCOCC2)C1=O)c1ccccc1
InChI Key: InChIKey=ILWQMZOJRMODQK-PMERELPUSA-N
Activity Spreadsheet -- Enzyme Inhibition Constant Data from BindingDB
Found 1 hit for monomerid = 50441729
Trg + Lig
Ki
nM
ΔG°
kcal/mole
IC50
nM
Kd
nM
EC50/IC50
nM
koff
s-1
kon
M-1s-1
pHTemp
°C
C-C chemokine receptor type 5
(Homo sapiens (Human))
BDBM50441729
(CHEMBL2435857)
Show SMILES Cc1nc(Sc2ccc(cc2)C(O)=O)ccc1CN1CCC(CC1)N1[C@@H](CN(C2CCOCC2)C1=O)c1ccccc1 |r|
Show InChI InChI=1S/C33H38N4O4S/c1-23-26(9-12-31(34-23)42-29-10-7-25(8-11-29)32(38)39)21-35-17-13-28(14-18-35)37-30(24-5-3-2-4-6-24)22-36(33(37)40)27-15-19-41-20-16-27/h2-12,27-28,30H,13-22H2,1H3,(H,38,39)/t30-/m0/s1
n/an/a 0.400n/an/an/an/an/an/a
Sanofi
Curated by ChEMBL
Assay Description
Inhibition of CCR5 (unknown origin) expressed in human HeLa cells assessed as inhibition of interaction of CHO cells expressing HIV-1 JRFLenv and HIV...
J Med Chem 56: 8049-65 (2013)
Article DOI: 10.1021/jm401101p
BindingDB Entry DOI: 10.7270/Q2445NX3