BDBM50441810 CHEMBL2436215::US10053431, 76b
SMILES: CN[C@@H](C)C(=O)N[C@H]1CN(C(=O)CS(C)(=O)=O)c2ccccc2N(Cc2c(OC)ccc3cc(Br)ccc23)C1=O
InChI Key: InChIKey=ADRJVDXZPHWNKH-JTSKRJEESA-N
Data: 4 IC50
Activity Spreadsheet -- Enzyme Inhibition Constant Data from BindingDB
Found 4 hits for monomerid = 50441810
Trg + Lig
Ki
nM
ΔG°
kcal/mole
IC50
nM
Kd
nM
EC50/IC50
nM
koff
s-1
kon
M-1s-1
pHTemp
°C
X-linked inhibitor of apoptosis protein (XIAP)
(Homo sapiens (Human))
BDBM50441810
(CHEMBL2436215 | US10053431, 76b)
Show SMILES CN[C@@H](C)C(=O)N[C@H]1CN(C(=O)CS(C)(=O)=O)c2ccccc2N(Cc2c(OC)ccc3cc(Br)ccc23)C1=O |r|
Show InChI InChI=1S/C28H31BrN4O6S/c1-17(30-2)27(35)31-22-15-32(26(34)16-40(4,37)38)23-7-5-6-8-24(23)33(28(22)36)14-21-20-11-10-19(29)13-18(20)9-12-25(21)39-3/h5-13,17,22,30H,14-16H2,1-4H3,(H,31,35)/t17-,22-/m0/s1
n/an/a>5.48E+4n/an/an/an/an/an/a
Hoffmann-La Roche Inc.
Curated by ChEMBL
Assay Description
Displacement of AVPIAQKSEK (epsilon-biotin)-OH from 6xhistidine-thrombin-TEV-tagged XIAP BIR3 domain (241 to 356) (unknown origin) after 45 mins by T...
J Med Chem 56: 7788-803 (2013)
Article DOI: 10.1021/jm400732v
BindingDB Entry DOI: 10.7270/Q2M32X6V
BIR3 (aa 241-356)
(Homo sapiens (Human))
BDBM50441810
(CHEMBL2436215 | US10053431, 76b)
Show SMILES CN[C@@H](C)C(=O)N[C@H]1CN(C(=O)CS(C)(=O)=O)c2ccccc2N(Cc2c(OC)ccc3cc(Br)ccc23)C1=O |r|
Show InChI InChI=1S/C28H31BrN4O6S/c1-17(30-2)27(35)31-22-15-32(26(34)16-40(4,37)38)23-7-5-6-8-24(23)33(28(22)36)14-21-20-11-10-19(29)13-18(20)9-12-25(21)39-3/h5-13,17,22,30H,14-16H2,1-4H3,(H,31,35)/t17-,22-/m0/s1
US Patent
n/an/a>5.48E+4n/an/an/an/a7.525
Hoffmann-La Roche Inc.
US Patent
Assay Description
Ten nanomolar of 6× Histidine-tagged BIR2 domain, corresponding to amino acids 124-240 of XIAP, or BIR3 domain, corresponding to amino acids 241-356 ...
US Patent US10053431 (2018)
BindingDB Entry DOI: 10.7270/Q2W097X3
BIR2 (aa 124-240)
(Homo sapiens (Human))
BDBM50441810
(CHEMBL2436215 | US10053431, 76b)
Show SMILES CN[C@@H](C)C(=O)N[C@H]1CN(C(=O)CS(C)(=O)=O)c2ccccc2N(Cc2c(OC)ccc3cc(Br)ccc23)C1=O |r|
Show InChI InChI=1S/C28H31BrN4O6S/c1-17(30-2)27(35)31-22-15-32(26(34)16-40(4,37)38)23-7-5-6-8-24(23)33(28(22)36)14-21-20-11-10-19(29)13-18(20)9-12-25(21)39-3/h5-13,17,22,30H,14-16H2,1-4H3,(H,31,35)/t17-,22-/m0/s1
US Patent
n/an/a 9n/an/an/an/a7.525
Hoffmann-La Roche Inc.
US Patent
Assay Description
Ten nanomolar of 6× Histidine-tagged BIR2 domain, corresponding to amino acids 124-240 of XIAP, or BIR3 domain, corresponding to amino acids 241-356 ...
US Patent US10053431 (2018)
BindingDB Entry DOI: 10.7270/Q2W097X3
X-linked inhibitor of apoptosis protein (XIAP)
(Homo sapiens (Human))
BDBM50441810
(CHEMBL2436215 | US10053431, 76b)
Show SMILES CN[C@@H](C)C(=O)N[C@H]1CN(C(=O)CS(C)(=O)=O)c2ccccc2N(Cc2c(OC)ccc3cc(Br)ccc23)C1=O |r|
Show InChI InChI=1S/C28H31BrN4O6S/c1-17(30-2)27(35)31-22-15-32(26(34)16-40(4,37)38)23-7-5-6-8-24(23)33(28(22)36)14-21-20-11-10-19(29)13-18(20)9-12-25(21)39-3/h5-13,17,22,30H,14-16H2,1-4H3,(H,31,35)/t17-,22-/m0/s1
n/an/a 9n/an/an/an/an/an/a
Hoffmann-La Roche Inc.
Curated by ChEMBL
Assay Description
Displacement of AVPIAQKSEK (epsilon-biotin)-OH from 6xhistidine-thrombin-TEV-tagged XIAP BIR2 domain (124 to 240) (unknown origin) after 45 mins by T...
J Med Chem 56: 7788-803 (2013)
Article DOI: 10.1021/jm400732v
BindingDB Entry DOI: 10.7270/Q2M32X6V