BDBM50441932 CHEMBL2437386
SMILES: COc1cc2CCN(CCCN3CCc4c(OCCF)cccc4C3=O)Cc2cc1OC
InChI Key: InChIKey=LXZHKHWPFHAUAJ-UHFFFAOYSA-N
Data: 1 KI  1 EC50
Activity Spreadsheet -- Enzyme Inhibition Constant Data from BindingDB
Found 2 hits for monomerid = 50441932
Trg + Lig
Ki
nM
ΔG°
kcal/mole
IC50
nM
Kd
nM
EC50/IC50
nM
koff
s-1
kon
M-1s-1
pHTemp
°C
Sigma non-opioid intracellular receptor 1
(Cavia porcellus (Guinea pig))
BDBM50441932
(CHEMBL2437386)
Show SMILES COc1cc2CCN(CCCN3CCc4c(OCCF)cccc4C3=O)Cc2cc1OC
Show InChI InChI=1S/C25H31FN2O4/c1-30-23-15-18-7-12-27(17-19(18)16-24(23)31-2)10-4-11-28-13-8-20-21(25(28)29)5-3-6-22(20)32-14-9-26/h3,5-6,15-16H,4,7-14,17H2,1-2H3
3.10E+3n/an/an/an/an/an/an/an/a
Universit£ degli Studi di Bari ALDO MORO
Curated by ChEMBL
Assay Description
Displacement of (+)-[3H]-pentazocine from sigma 1 receptor in Dunkin guinea pig brain membranes without cerebellum
Eur J Med Chem 69: 920-30 (2013)
Article DOI: 10.1016/j.ejmech.2013.09.018
BindingDB Entry DOI: 10.7270/Q2K64KH7
P-glycoprotein 1
(Homo sapiens (Human))
BDBM50441932
(CHEMBL2437386)
Show SMILES COc1cc2CCN(CCCN3CCc4c(OCCF)cccc4C3=O)Cc2cc1OC
Show InChI InChI=1S/C25H31FN2O4/c1-30-23-15-18-7-12-27(17-19(18)16-24(23)31-2)10-4-11-28-13-8-20-21(25(28)29)5-3-6-22(20)32-14-9-26/h3,5-6,15-16H,4,7-14,17H2,1-2H3
n/an/an/an/a 5.00E+3n/an/an/an/a
Universit£ degli Studi di Bari ALDO MORO
Curated by ChEMBL
Assay Description
Activity at human MDR1 expressed in MDCK cells assessed as Calcein-AM uptake after 30 mins by fluorescence assay
Eur J Med Chem 69: 920-30 (2013)
Article DOI: 10.1016/j.ejmech.2013.09.018
BindingDB Entry DOI: 10.7270/Q2K64KH7