BDBM50442164 CHEMBL2441345
SMILES: Cc1cc(C)n(CC(=O)N2CCc3cc(ccc23)-c2cn(C)c3ncnc(N)c23)n1
InChI Key: InChIKey=YOPJEHCJCZXQQN-UHFFFAOYSA-N
Data: 2 IC50
Activity Spreadsheet -- Enzyme Inhibition Constant Data from BindingDB
Found 2 hits for monomerid = 50442164
Trg + Lig
Ki
nM
ΔG°
kcal/mole
IC50
nM
Kd
nM
EC50/IC50
nM
koff
s-1
kon
M-1s-1
pHTemp
°C
Eukaryotic translation initiation factor 2-alpha kinase 3
(Homo sapiens (Human))
BDBM50442164
(CHEMBL2441345)
Show SMILES Cc1cc(C)n(CC(=O)N2CCc3cc(ccc23)-c2cn(C)c3ncnc(N)c23)n1
Show InChI InChI=1S/C22H23N7O/c1-13-8-14(2)29(26-13)11-19(30)28-7-6-16-9-15(4-5-18(16)28)17-10-27(3)22-20(17)21(23)24-12-25-22/h4-5,8-10,12H,6-7,11H2,1-3H3,(H2,23,24,25)
n/an/a 1.90n/an/an/an/an/an/a
GlaxoSmithKline Research and Development
Curated by ChEMBL
Assay Description
Inhibition of GST-tagged PERK cytoplasmic domain (536 to 1116) (unknown origin) assessed as biotinylated His6-tagged EIF2alpha phosphorylation preinc...
ACS Med Chem Lett 4: 964-8 (2013)
Article DOI: 10.1021/ml400228e
BindingDB Entry DOI: 10.7270/Q24X597X
Eukaryotic translation initiation factor 2-alpha kinase 3
(Homo sapiens (Human))
BDBM50442164
(CHEMBL2441345)
Show SMILES Cc1cc(C)n(CC(=O)N2CCc3cc(ccc23)-c2cn(C)c3ncnc(N)c23)n1
Show InChI InChI=1S/C22H23N7O/c1-13-8-14(2)29(26-13)11-19(30)28-7-6-16-9-15(4-5-18(16)28)17-10-27(3)22-20(17)21(23)24-12-25-22/h4-5,8-10,12H,6-7,11H2,1-3H3,(H2,23,24,25)
n/an/a 100n/an/an/an/an/an/a
GlaxoSmithKline Research and Development
Curated by ChEMBL
Assay Description
Inhibition of thapsigargin-induced autophosphorylation of PERK in human A549 cells preincubated for 1 hr followed by thapsigargin-induction measured ...
ACS Med Chem Lett 4: 964-8 (2013)
Article DOI: 10.1021/ml400228e
BindingDB Entry DOI: 10.7270/Q24X597X